{"text_format":"1","workbook":"xlsx","n_sheets":9,"sheets":["Base","BaseTalentoHumano","BaseNorma","Menu","Infraestructura","Equipamiento","Norma","TalentoHumano","Reportes"],"not_rendered":{"charts":0,"images":5,"macros":1,"external_links":1,"defined_names":5,"comments":3,"pivot_tables":0},"unopened":[],"bounds":{"document_bytes":16777216,"sheet_cells":100000,"rows_first":2000,"rows_last":500,"rows_between":2000,"halvings":0,"cell_chars":16384,"cell_head_chars":4096},"cells_cut":0,"cells_raw":0,"read":"whole","date_system":"1900"}

{"sheet":"Base","index":0,"n_rows":457,"n_cols":23,"rows_kept":457,"cut":false,"hidden":false,"merged":[[454,1,456,2],[454,3,454,4],[455,3,455,4],[456,3,456,4],[448,1,450,2],[448,3,448,4],[449,3,449,4],[450,3,450,4],[451,1,451,2],[451,3,451,4],[452,1,453,2],[452,3,452,4],[453,3,453,4],[440,3,440,4],[441,3,441,4],[442,3,442,4],[443,3,443,4],[444,1,445,2],[444,3,444,4],[445,3,445,4],[446,1,447,2],[446,3,446,4],[447,3,447,4],[370,9,376,9],[377,4,379,4],[377,5,379,5],[377,6,379,6],[377,7,379,7],[377,8,379,8],[377,9,379,9],[380,3,381,3],[382,2,408,2],[382,3,406,3],[382,4,385,4],[382,5,385,5],[382,6,385,6],[382,7,385,7],[382,8,394,8],[382,9,385,9],[386,4,394,4],[386,5,394,5],[386,6,394,6],[386,7,394,7],[386,9,394,9],[395,4,400,4],[395,5,400,5],[395,6,400,6],[401,7,406,7],[401,8,406,8],[407,3,408,3],[409,2,428,2],[409,3,426,3],[410,4,413,4],[410,5,413,5],[410,6,413,6],[410,7,413,7],[410,8,413,8],[414,4,417,4],[414,5,417,5],[414,6,417,6],[414,7,417,7],[414,8,426,8],[418,7,426,7],[354,8,359,8],[354,9,359,9],[360,4,367,4],[360,5,367,5],[360,6,367,6],[360,7,367,7],[360,8,367,8],[360,9,367,9],[368,3,369,3],[341,7,346,7],[341,8,346,8],[341,9,346,9],[347,4,353,4],[347,5,353,5],[347,6,353,6],[347,7,353,7],[347,8,353,8],[347,9,353,9],[325,7,327,7],[325,8,327,8],[325,9,327,9],[328,7,333,7],[328,8,333,8],[328,9,333,9],[334,4,340,4],[334,5,340,5],[334,6,340,6],[334,7,340,7],[334,8,340,8],[334,9,340,9],[299,0,317,0],[299,1,317,1],[299,2,317,2],[299,3,315,3],[299,4,309,4],[299,5,309,5],[299,6,309,6],[299,7,309,7],[299,8,309,8],[310,4,315,4],[310,5,315,5],[310,6,315,6],[310,7,315,7],[310,8,315,8],[290,2,298,2],[290,3,296,3],[290,4,296,4],[290,5,296,5],[290,6,296,6],[290,7,296,7],[290,8,296,8],[290,9,296,9],[297,3,298,3],[271,6,272,6],[271,7,272,7],[271,8,272,8],[271,9,272,9],[273,4,277,4],[273,5,277,5],[273,6,277,6],[273,7,277,7],[273,8,277,8],[273,9,277,9],[224,8,233,8],[224,9,233,9],[234,4,246,4],[234,5,246,5],[234,6,246,6],[234,7,246,7],[234,8,246,8],[234,9,246,9],[247,4,267,4],[247,5,267,5],[247,6,267,6],[247,7,267,7],[247,8,267,8],[247,9,267,9],[218,4,223,4],[218,5,223,5],[218,6,223,6],[218,7,223,7],[218,8,223,8],[218,9,223,9],[199,7,212,7],[199,8,212,8],[199,9,212,9],[160,4,162,4],[160,5,162,5],[160,6,162,6],[160,7,162,7],[160,8,162,8],[160,9,162,9],[163,3,164,3],[209,15,212,15],[213,4,217,4],[213,5,217,5],[213,6,217,6],[213,7,217,7],[213,8,217,8],[213,9,217,9],[193,7,196,7],[193,8,196,8],[193,9,196,9],[199,4,212,4],[199,5,212,5],[199,6,212,6],[171,4,174,4],[171,5,174,5],[171,6,174,6],[171,7,174,7],[92,3,93,3],[94,0,185,0],[94,1,185,1],[94,2,124,2],[94,3,122,3],[94,4,97,4],[94,5,97,5],[94,6,97,6],[94,7,97,7],[98,4,117,4],[98,5,117,5],[98,6,117,6],[98,7,117,7],[118,4,122,4],[118,5,122,5],[118,6,122,6],[118,7,122,7],[123,3,124,3],[125,2,133,2],[125,3,131,3],[125,4,128,4],[125,5,128,5],[125,6,128,6],[125,7,128,7],[75,4,81,4],[75,5,81,5],[75,6,81,6],[75,7,81,7],[75,8,81,8],[75,9,81,9],[82,4,91,4],[82,5,91,5],[82,6,91,6],[82,7,91,7],[82,8,91,8],[82,9,91,9],[19,0,93,0],[19,1,93,1],[19,2,93,2],[19,3,91,3],[19,4,23,4],[19,5,23,5],[19,6,23,6],[19,7,23,7],[19,8,23,8],[24,4,32,4],[24,5,32,5],[24,6,32,6],[24,7,32,7],[24,8,32,8],[33,4,53,4],[33,5,53,5],[33,6,53,6],[33,7,53,7],[33,8,53,8],[54,4,74,4],[54,5,74,5],[54,6,74,6],[54,7,74,7],[54,8,74,8],[0,0,0,15],[2,0,18,0],[2,1,18,1],[2,2,18,2],[2,3,16,3],[2,4,8,4],[2,5,8,5],[2,6,8,6],[2,7,8,7],[2,8,8,8],[2,9,8,9],[9,4,16,4],[9,5,16,5],[9,6,16,6],[9,7,16,7],[9,8,16,8],[9,9,16,9],[12,15,14,15],[17,3,18,3],[19,9,23,9],[24,9,32,9],[33,9,53,9],[54,9,74,9],[94,8,97,8],[94,9,97,9],[98,8,117,8],[98,9,117,9],[118,8,122,8],[118,9,122,9],[130,4,131,4],[130,5,131,5],[132,3,133,3],[134,2,154,2],[134,3,152,3],[134,4,142,4],[134,5,142,5],[143,4,152,4],[143,5,152,5],[125,8,128,8],[125,9,128,9],[130,6,131,6],[130,7,131,7],[130,8,131,8],[130,9,131,9],[134,6,142,6],[134,7,142,7],[134,8,142,8],[134,9,142,9],[165,2,185,2],[165,3,183,3],[175,4,183,4],[175,5,183,5],[184,3,185,3],[143,6,152,6],[143,7,152,7],[143,8,152,8],[143,9,152,9],[153,3,154,3],[165,4,170,4],[165,5,170,5],[165,6,170,6],[165,7,170,7],[165,8,170,8],[165,9,170,9],[155,2,164,2],[155,3,162,3],[155,4,159,4],[155,5,159,5],[155,6,159,6],[155,7,159,7],[155,8,159,8],[155,9,159,9],[186,4,192,4],[193,4,196,4],[193,5,196,5],[193,6,196,6],[171,8,174,8],[171,9,174,9],[175,6,183,6],[175,7,183,7],[175,8,183,8],[175,9,183,9],[186,5,192,5],[186,6,192,6],[186,7,192,7],[186,8,192,8],[186,9,192,9],[318,8,324,8],[318,9,324,9],[325,4,327,4],[325,5,327,5],[199,2,270,2],[199,3,268,3],[224,4,233,4],[186,0,298,0],[197,3,198,3],[224,5,233,5],[224,6,233,6],[224,7,233,7],[269,3,270,3],[271,2,289,2],[271,3,287,3],[271,4,272,4],[271,5,272,5],[278,4,283,4],[278,5,283,5],[278,6,283,6],[278,7,283,7],[186,1,298,1],[186,2,198,2],[186,3,196,3],[418,9,426,9],[427,3,428,3],[429,2,433,2],[429,3,431,3],[432,3,433,3],[278,8,283,8],[278,9,283,9],[284,4,287,4],[316,3,317,3],[299,9,309,9],[310,9,315,9],[395,9,400,9],[401,9,406,9],[410,9,413,9],[354,7,359,7],[284,5,287,5],[284,6,287,6],[284,7,287,7],[284,8,287,8],[284,9,287,9],[288,3,289,3],[318,4,324,4],[318,5,324,5],[318,7,324,7],[434,0,437,10],[438,0,456,0],[438,1,438,2],[438,3,438,4],[439,1,443,2],[439,3,439,4],[370,0,433,0],[370,1,433,1],[370,2,381,2],[370,3,379,3],[370,4,376,4],[370,5,376,5],[370,6,376,6],[370,7,376,7],[370,8,376,8],[395,7,400,7],[395,8,400,8],[401,4,406,4],[401,5,406,5],[401,6,406,6],[414,9,417,9],[418,4,426,4],[418,5,426,5],[418,6,426,6],[318,0,369,0],[318,1,369,1],[318,2,369,2],[318,3,367,3],[328,4,333,4],[328,5,333,5],[328,6,333,6],[354,4,359,4],[354,5,359,5],[354,6,359,6],[325,6,327,6],[341,4,346,4],[341,5,346,5],[341,6,346,6],[318,6,324,6]]}
[" CENTRO ESPECIALIZADO EN DIÁLISIS PERITONEAL",null,null,null,null,null,null,null,null,null,null,null,null,null,null,null,null,"EM","Equipo Medico",null,null,null,"Condición"]
["GRUPO 00","GRUPO 01","GRUPO 03","GRUPO 03","ESPACIO","TIPO INFRAESTRUCTURA","Cant","ANEXO","Obs","TIPO","EQUIPAMIENTO","Cant * Esp","TIPO EQUIP","ANEXO","TIPO","Obs"]
["ADMINISTRATIVO","ADMISIÓN Y ESTADÍSTICA ","Área Técnica ","AMBIENTES","Admisión, Información y Recepción","AMBIENTE",1,null,"Para construcciones nuevas deseable 6 m2","Requerido","Mostrador / escritorio/Mesa de despacho ",1,"MG","EQ_01"]
[null,null,null,null,null,null,null,null,null,null,"Armario/Archivador",1,"MG",null,null,"Puede estar incorporado en el Mostrador/escritorio o Mesa de despacho lo que se requiere es que tengan donde almacenar documentos temporalmente"]
[null,null,null,null,null,null,null,null,null,null,"Computador completo (Portátil o de escritorio)",1,"EG","EQ_02"]
[null,null,null,null,null,null,null,null,null,null,"Basurero",1,"MG",null,null,"Recipiente para desechos comunes"]
[null,null,null,null,null,null,null,null,null,null,"Silla",1,"MG"]
[null,null,null,null,null,null,null,null,null,null,"Tablero de avisos ",1,"MG",null,null,"Puede ser remplazado cuando hay acceso directo al sistema audiovisual de la sala de espera de consulta externa"]
[null,null,null,null,null,null,null,null,null,null,"Teléfono",1,"EG"]
[null,null,null,null,"Archivo","AMBIENTE",1,null,"Para construcciones nuevas calcular según la demanda (cantidad y tipo de elementos a archivar)","Requerido","Estantería ",1,"MG"]
[null,null,null,null,null,null,null,null,null,null,"Armario/Archivador",1,"MG"]
[null,null,null,null,null,null,null,null,null,null,"Escalera pata de gallo / Gradilla",1,"MG",null,"Condición","Si es que tiene estanterías altas que no sean accesibles al operador/funcionario/usuario"]
[null,null,null,null,null,null,null,null,null,null,"Escritorio/ Mesa de despacho  ",1,"MG","EQ_01","Condición","Se activará cuando el  servicio posea otra zona administrativa responsable del manejo exclusivo del archivo"]
[null,null,null,null,null,null,null,null,null,null,"Computador completo (Portátil o de Escritorio)",1,"EG","EQ_02","Condición"]
[null,null,null,null,null,null,null,null,null,null,"Silla ",1,"MG",null,"Condición"]
[null,null,null,null,null,null,null,null,null,null,"Basurero ",1,"MG",null,null,"Recipiente para desechos comunes"]
[null,null,null,null,null,null,null,null,null,null,"Extintor de incendios  portátil  ",1,"EG",null,null,"Se verificará según la normativa y que este accesible para este ambiente aunque este compartido con otro "]
[null,null,null,"INSTALACIONES","Estructura General ","INSTALACIÓN",1,"EG_01",null,"Requerido"]
[null,null,null,null,"Instalaciones Generales","INSTALACIÓN",1,"IG_01",null,"Requerido"]
["ASISTENCIAL","CONSULTA EXTERNA","Área de Atención de Consulta","AMBIENTES","Sala de Espera","AMBIENTE",1,null,"Para construcciones nuevas deseable, 1 familiar por paciente y  1 paciente por puesto de  diálisis, 1m2 por persona","Requerido","Banca/sillas",2,"MG",null,null,"Mínimo contar con 6 puestos para la sala de espera (bancas en tándem o sillas o sillones)"]
[null,null,null,null,null,null,null,null,null,null,"Basurero",1,"MG",null,null,"Recipiente para desechos comunes"]
[null,null,null,null,null,null,null,null,null,null,"Reloj de pared",1,"MG"]
[null,null,null,null,null,null,null,null,null,null,"Extintor de incendios  portátil  ",1,"EG",null,null,"El mismo que cubrirá toda el servicio de consulta externa / Se verificará según la normativa y que este accesible para este ambiente aunque este compartido con otro "]
[null,null,null,null,null,null,null,null,null,null,"Sistema Audiovisual de Información",1,"EG","EQ_03"]
[null,null,null,null,"Baños/Baterías Sanitarias","AMBIENTE",1,null,"Para construcciones nuevas deseable 4m2","Requerido","Inodoro",1,"MG"]
[null,null,null,null,null,null,null,null,null,null,"Dispensador de papel higiénico",null,"MG"]
[null,null,null,null,null,null,null,null,null,null,"Lavabo",1,"MG"]
[null,null,null,null,null,null,null,null,null,null,"Dispensador de jabón",1,"MG"]
[null,null,null,null,null,null,null,null,null,null,"Dispensador de papel toalla",1,"MG",null,null,"Se justifica si cuenta con secador de manos"]
[null,null,null,null,null,null,null,null,null,null,"Espejo empotrado ",1,"MG"]
[null,null,null,null,null,null,null,null,null,null,"Barras de apoyo",1,"MG",null,"Deseable"]
[null,null,null,null,null,null,null,null,null,null,"Gancho doble",1,"MG"]
[null,null,null,null,null,null,null,null,null,null,"Basurero  ",2,"MG",null,null,"Recipiente para desechos comunes e infecciosos. Se justifica recipiente de desechos comunes si cuenta con secador de manos"]
[null,null,null,null,"Enfermería (Se vuelve requerido en el caso de contar con más de 5 consultorios para profesionales médicos)","AMBIENTE",1,null," Para construcciones nuevas deseable 16m2","Condición","Escritorio/Mesa de despacho",1,"MG","EQ_01"]
[null,null,null,null,null,null,null,null,null,null,"Computador completo (Portátil o de Escritorio)",1,"EG","EQ_02"]
[null,null,null,null,null,null,null,null,null,null,"Armario/Vitrina/Archivador",1,"MG"]
[null,null,null,null,null,null,null,null,null,null,"Báscula + tallímetro",1,"EM"]
[null,null,null,null,null,null,null,null,null,null,"Cinta métrica",1,"EM"]
[null,null,null,null,null,null,null,null,null,null,"Set de recipientes para el manejo de desechos peligrosos y no peligrosos",1,"MG","EQ_07"]
[null,null,null,null,null,null,null,null,null,null,"Camilla de exploración",1,"MM",null,"Condición"]
[null,null,null,null,null,null,null,null,null,null,"Escabel ",1,"MG",null,"Condición","Requerido en el caso de contar con camila de exploración y esta no sea regulable hasta un altura mínima de 50 cm desde el piso"]
[null,null,null,null,null,null,null,null,null,null,"Coche de curaciones ",1,"MM","EQ_08"]
[null,null,null,null,null,null,null,null,null,null,"Lámpara examen rodable",1,"EM"]
[null,null,null,null,null,null,null,null,null,null,"Mesa auxiliar",1,"MM"]
[null,null,null,null,null,null,null,null,null,null,"Dispensador de papel toalla",1,"MG"]
[null,null,null,null,null,null,null,null,null,null,"Dispensador de jabón",1,"MG"]
[null,null,null,null,null,null,null,null,null,null,"Lavabo",1,"MG"]
[null,null,null,null,null,null,null,null,null,null,"Estetoscopio para adultos",1,"EM"]
[null,null,null,null,null,null,null,null,null,null,"Tensiómetro  para adultos",1,"EM"]
[null,null,null,null,null,null,null,null,null,null,"Tensiómetro pediátrico",1,"EM",null,"Condición","Se justifica cuando el tensiómetro para adultos cuenta con brazaletes para tallas pediátricas / Será requerido en el caso de ofertar prestación pediátrica"]
[null,null,null,null,null,null,null,null,null,null,"Estetoscopio pediátrico",1,"EM",null,"Condición","Será requerido en el caso de ofertar prestación pediátrica"]
[null,null,null,null,null,null,null,null,null,null,"Termómetro",1,"EM",null,null,"Deseable que sea digital"]
[null,null,null,null,null,null,null,null,null,null,"Silla confidente",1,"MG"]
[null,null,null,null,null,null,null,null,null,null,"Silla",1,"MG"]
[null,null,null,null,"Consultorio Médico","AMBIENTE",1,null,"Para construcciones nuevas deseable 16m2","Requerido","Escritorio/Mesa de despacho",1,"MG","EQ_01"]
[null,null,null,null,null,null,null,null,null,null,"Computador completo (portátil o de escritorio)",1,"EG","EQ_02"]
[null,null,null,null,null,null,null,null,null,null,"Armario/Archivador/Vitrina",1,"MG"]
[null,null,null,null,null,null,null,null,null,null,"Báscula + tallímetro",1,"EM",null,null,"Se justifica si el servicio cuenta con enfermería"]
[null,null,null,null,null,null,null,null,null,null,"Camilla de exploración",1,"MG"]
[null,null,null,null,null,null,null,null,null,null,"Escabel  ",1,"MG",null,null,"Se justifica si la camilla de exploración es regulable hasta un altura mínima de 50 cm desde el piso"]
[null,null,null,null,null,null,null,null,null,null,"Set de diagnóstico",1,"EM","EQ_10"]
[null,null,null,null,null,null,null,null,null,null,"Coche de curaciones ",1,"MG","EQ_09","Condición","Será requerido en el caso de no contar con este en enfermermería"]
[null,null,null,null,null,null,null,null,null,null,"Dispensador de papel toalla",1,"MG"]
[null,null,null,null,null,null,null,null,null,null,"Dispensador de jabón",1,"MG"]
[null,null,null,null,null,null,null,null,null,null,"Lavabo",1,"EG"]
[null,null,null,null,null,null,null,null,null,null,"Tensiómetro para adultos",1,"EM"]
[null,null,null,null,null,null,null,null,null,null,"Estetoscopio para adultos",1,"EM"]
[null,null,null,null,null,null,null,null,null,null,"Tensiómetro pediátrico",1,"EM",null,"Condición","Se justifica cuando el tensiómetro para adultos cuenta con brazaletes para tallas pediátricas / Será requerido en el caso de ofertar prestación pediátrica"]
[null,null,null,null,null,null,null,null,null,null,"Estetoscopio pediátrico",1,"EM",null,"Condición","Será requerido en el caso de ofertar prestación pediátrica"]
[null,null,null,null,null,null,null,null,null,null,"Termómetro",1,"EM",null,null,"Deseable que sea digital"]
[null,null,null,null,null,null,null,null,null,null,"Negatoscopio",1,"EM"]
[null,null,null,null,null,null,null,null,null,null,"Lámpara de examen rodable",1,"MM"]
[null,null,null,null,null,null,null,null,null,null,"Set de recipientes para el manejo de desechos peligrosos y no peligrosos",1,"MG","EQ_07"]
[null,null,null,null,null,null,null,null,null,null,"Silla confidente",2,"MG"]
[null,null,null,null,null,null,null,null,null,null,"Silla",1,"MG"]
[null,null,null,null,"Consultorio de Psicología (Puede compartir con la Oficina de Trabajo Social y el Consultorio de Nutrición, pero debe asegurarse la privacidad del paciente mediante horarios diferenciados en cada prestación)","AMBIENTE",1,null,"Para construcciones nuevas deseable 12m2","Requerido","Escritorio/Mesa de despacho",1,"MG","EQ_01"]
[null,null,null,null,null,null,null,null,null,null,"Computador completo (Portátil o de escritorio)",1,"EM","EQ_02"]
[null,null,null,null,null,null,null,null,null,null,"Armario/Vitrina/Archivador",1,"MG"]
[null,null,null,null,null,null,null,null,null,null,"Basurero",1,"MG",null,null,"Recipiente para desechos comunes"]
[null,null,null,null,null,null,null,null,null,null,"Dispensador para solución hidroalcohólica",1,"MG"]
[null,null,null,null,null,null,null,null,null,null,"Silla confidente",2,"MG"]
[null,null,null,null,null,null,null,null,null,null,"Silla",1,"MG"]
[null,null,null,null,"Consultorio de Nutrición (Puede compartir con la Oficina de Trabajo Social y el Consultorio de Psicología,  pero debe asegurarse la privacidad del paciente mediante horarios diferenciados en cada prestación)","AMBIENTE",1,null,"Para construcciones nuevas deseable 12m2","Requerido","Escritorio/Mesa de despacho",1,"MG","EQ_01"]
[null,null,null,null,null,null,null,null,null,null,"Computador completo (Portátil o de escritorio)",1,"EG","EQ_02"]
[null,null,null,null,null,null,null,null,null,null,"Armario/Vitrina/Archivador",1,"MG"]
[null,null,null,null,null,null,null,null,null,null,"Plicómetro",1,"EM",null,"Condición"]
[null,null,null,null,null,null,null,null,null,null,"Cinta métrica",1,"EM"]
[null,null,null,null,null,null,null,null,null,null,"Báscula + tallimetro",1,"EM"]
[null,null,null,null,null,null,null,null,null,null,"Silla confidente",2,"MG"]
[null,null,null,null,null,null,null,null,null,null,"Silla",1,"MG"]
[null,null,null,null,null,null,null,null,null,null,"Basurero",1,"MG",null,null,"Recipiente para desechos comunes"]
[null,null,null,null,null,null,null,null,null,null,"Dispensador para solución hidroalcohólica",1,"MG"]
[null,null,null,"INSTALACIONES","Estructura General ","INSTALACIÓN",1,"EG_01",null,"Requerido"]
[null,null,null,null,"Instalaciones Generales","INSTALACIÓN",1,"IG_01",null,"Requerido"]
["APOYO TERAPÉUTICO","ATENCIÓN DE APOYO TERAPÉUTICO","Área de Procedimientos","AMBIENTES","Área de Lavado de Manos","AMBIENTE",1,null,null,"Condición","Lavabo",1,"MG"]
[null,null,null,null,null,null,null,null,null,null,"Dispensador de jabón",1,"MG"]
[null,null,null,null,null,null,null,null,null,null,"Dispensador de papel toalla",1,"MG"]
[null,null,null,null,null,null,null,null,null,null,"Basurero",1,"MG",null,null,"Recipiente para desechos comunes"]
[null,null,null,null,"Sala de procedimientos (Debe existir acuerdo con un establecimiento que cuente con atención en centro quirúrgico para inserción de catéteres peritoneales, en caso de no haber convenio se hará requerido)","AMBIENTE",1,null,"Para construcciones nuevas deseable 16m2","Condición","Camilla de exploración/Mesa de operaciones",1,"MM",null,null,"Será requerido una mesa de operaciones si se realiza inserción de catéteres"]
[null,null,null,null,null,null,null,null,null,null,"Porta sueros",1,"EM"]
[null,null,null,null,null,null,null,null,null,null,"Tensiómetro para adultos",1,"EM"]
[null,null,null,null,null,null,null,null,null,null,"Estetoscopio para adultos",1,"EM"]
[null,null,null,null,null,null,null,null,null,null,"Tensiómetro pediátrico",1,"EM",null,"Condición","Se justifica cuando el tensiómetro para adultos cuenta con brazaletes para tallas pediátricas / Será requerido en el caso de ofertar prestación pediátrica"]
[null,null,null,null,null,null,null,null,null,null,"Estetoscopio pediátrico",1,"EM",null,"Condición","Será requerido en el caso de ofertar prestación pediátrica"]
[null,null,null,null,null,null,null,null,null,null,"Coche de paro completo y reanimación",1,"EM","EQ_09","Condición","Será requerido en el caso de que realice inserción de catéteres/Se justifica si hay acceso directo a la sala de recambio"]
[null,null,null,null,null,null,null,null,null,null,"Desfibrilador",1,"EM",null,"Condición","Será requerido en el caso de que realice inserción de catéteres/Se justifica si hay acceso directo a la sala de recambio"]
[null,null,null,null,null,null,null,null,null,null,"Electrocardiógrafo",1,"EM",null,"Condición","Será requerido en el caso de que realice inserción de catéteres/Se justifica si hay acceso directo a la sala de recambio"]
[null,null,null,null,null,null,null,null,null,null,"Equipo de oxígeno portátil",1,"EM",null,"Condición","Será requerido en el caso de que realice inserción de catéteres/Se justifica si hay acceso directo a la sala de recambio"]
[null,null,null,null,null,null,null,null,null,null,"Lámpara quirúrgica básica cielítica portátil o fija/Lámpara de examen rodable",1,"MM",null,null,"Será requerida la lámpara quirúrgica si se realiza inserción de catéteres"]
[null,null,null,null,null,null,null,null,null,null,"Monitor de parámetros vitales",1,"EM",null,"Condición","Será requerido en el caso de que realice inserción de catéteres"]
[null,null,null,null,null,null,null,null,null,null,"Silla/taburete giratorio",1,"MG"]
[null,null,null,null,null,null,null,null,null,null,"Coche de curaciones ",1,"EM","EQ_08"]
[null,null,null,null,null,null,null,null,null,null,"Mesa mayo",1,"MM"]
[null,null,null,null,null,null,null,null,null,null,"Equipo de cirugía general - cirugía mayor",1,"EM","EQ_30","Condición","Será requerido en el caso de que realice inserción de catéteres"]
[null,null,null,null,null,null,null,null,null,null,"Mesa para instrumental",1,"MM",null,"Condición","Será requerido en el caso de que realice inserción de catéteres"]
[null,null,null,null,null,null,null,null,null,null,"Soporte bajo rodado, una cubeta acero inoxidable  ",1,"MG",null,"Condición","Será requerido en el caso de que realice inserción de catéteres"]
[null,null,null,null,null,null,null,null,null,null,"Set de recipientes para el manejo de desechos peligrosos y no peligrosos",1,"MG","EQ_07"]
[null,null,null,null,null,null,null,null,null,null,"Flujómetro para O2 con humidificador",1,"MG",null,"Condición","Será requerido en el caso de que realice inserción de catéteres"]
[null,null,null,null,"Zona de esterilización (Se convierte en Requerido si existe la Sala de Procedimientos. Puede seguir como condición  en el caso de tener externalizado el servicio de esterilización)","AMBIENTE",1,null,"-","Condición","Esterilizador a vapor / calor seco",1,"EM"]
[null,null,null,null,null,null,null,null,null,null,"Dispensador de papel toalla",1,"MG"]
[null,null,null,null,null,null,null,null,null,null,"Dispensador de jabón",1,"MG"]
[null,null,null,null,null,null,null,null,null,null,"Basurero",1,"MG",null,null,"Recipiente para desechos comunes"]
[null,null,null,null,null,null,null,null,null,null,"Mesón con fregadero",1,"MG"]
[null,null,null,"INSTALACIONES","Estructura General ","INSTALACIÓN",1,"DIA_EG_01",null,"Condición"]
[null,null,null,null,"Instalaciones Generales","INSTALACIÓN",1,"DIA_IG_01",null,"Condición"]
[null,null,"Área de Soporte y Suministros (Esta área funcional debe estar centralizada y no debe estar en contacto con las áreas de diálisis peritoneal)","AMBIENTES","Cuarto de limpieza","AMBIENTE",1,null,"Para construcciones nuevas deseable 2m2","Requerido","Coche de limpieza",1,"MG"]
[null,null,null,null,null,null,null,null,null,null,"Stock de Insumos de Limpieza",1,"EG","EQ_05"]
[null,null,null,null,null,null,null,null,null,null,"Estantería",1,"MG"]
[null,null,null,null,null,null,null,null,null,null,"Lavadero con poza profunda para el preparado y enjuague de los útiles de limpieza",1,"MG"]
[null,null,null,null,"Almacenamiento intermedio o temporal de desechos (Será requerido en los establecimientos cuya generación supere los 65 Kg/día de desechos sanitarios y si se realiza la colocación de catéteres)","AMBIENTE",1,null,"Para construcciones nuevas deseable 4m2","Condición","Set de recipientes para el manejo de desechos peligrosos y no peligrosos",1,"MG","EQ_07"]
[null,null,null,null,"Lencería (Será requerido en el caso de contar con lencería que deba ser esterilizada)","AMBIENTE",1,null,"Para construcciones nuevas  4m2","Condición","Estantería",1,"MG"]
[null,null,null,null,null,null,null,null,null,null,"Coche de ropa limpia",1,"MG"]
[null,null,null,"INSTALACIONES","Estructura General ","INSTALACIÓN",1,"EG_01",null,"Requerido"]
[null,null,null,null,"Instalaciones Generales","INSTALACIÓN",1,"IG_01",null,"Requerido"]
[null,null,"Área de Diálisis Peritoneal","AMBIENTES","Sala de entrenamiento","AMBIENTE",1,null,"Para construcciones nuevas deseable 20m2","Requerido","Silla",2,"MG"]
[null,null,null,null,null,null,null,null,null,null,"Coche de curaciones ",1,"MM","EQ_08"]
[null,null,null,null,null,null,null,null,null,null,"Mesa auxiliar para equipos",1,"MG"]
[null,null,null,null,null,null,null,null,null,null,"Camilla/Sillón reclinable",1,"MM",null,"Condición"]
[null,null,null,null,null,null,null,null,null,null,"Mesón con doble Lavabo",1,"MG"]
[null,null,null,null,null,null,null,null,null,null,"Porta sueros",1,"EM"]
[null,null,null,null,null,null,null,null,null,null,"Máquina Cicladora",2,"EM",null,null,"Una máquina es de reserva"]
[null,null,null,null,null,null,null,null,null,null,"Set de recipientes para el manejo de desechos peligrosos y no peligrosos",1,"MG","EQ_07"]
[null,null,null,null,null,null,null,null,null,null,"Sistema Audiovisual de Información",1,"EG","EQ_03"]
[null,null,null,null,"Área de recambios","AMBIENTE",1,null,"Para construcciones nuevas deseable 8m2","Requerido","Camilla/Sillón Reclinable",1,"MG"]
[null,null,null,null,null,null,null,null,null,null,"Silla",1,"MG"]
[null,null,null,null,null,null,null,null,null,null,"Porta sueros",1,"EM"]
[null,null,null,null,null,null,null,null,null,null,"Set de recipientes para el manejo de desechos peligrosos y no peligrosos",1,"MG","EQ_07"]
[null,null,null,null,null,null,null,null,null,null,"Máquina Cicladora",1,"EM"]
[null,null,null,null,null,null,null,null,null,null,"Coche de paro completo y reanimación",1,"EM","EQ_09"]
[null,null,null,null,null,null,null,null,null,null,"Desfibrilador",1,"EM"]
[null,null,null,null,null,null,null,null,null,null,"Electrocardiógrafo",1,"EM"]
[null,null,null,null,null,null,null,null,null,null,"Equipo de oxígeno portátil",1,"EM"]
[null,null,null,null,null,null,null,null,null,null,"Mesa auxiliar para equipos",1,"MG"]
[null,null,null,"INSTALACIONES","Estructura General ","INSTALACIÓN",1,"EG_01",null,"Requerido"]
[null,null,null,null,"Instalaciones Generales","INSTALACIÓN",1,"IG_01",null,"Requerido"]
[null,null,"Área Técnica de Apoyo","AMBIENTES","Limpio","AMBIENTE",1,null,"Para construcciones nuevas deseable 6m2","Requerido","Mesón con lavabo",1,"MG"]
[null,null,null,null,null,null,null,null,null,null,"Dispensador de papel toalla",1,"MG"]
[null,null,null,null,null,null,null,null,null,null,"Dispensador de jabón",1,"MG"]
[null,null,null,null,null,null,null,null,null,null,"Armario/Vitrina",1,"MG"]
[null,null,null,null,null,null,null,null,null,null,"Basurero",1,"MG",null,null,"Recipiente para desechos comunes"]
[null,null,null,null,"Usado","AMBIENTE",1,null,"Para construcciones nuevas deseable 6m2","Requerido","Estantería",1,"MG"]
[null,null,null,null,null,null,null,null,null,null,"Basurero",1,"MG",null,null,"Recipientes para desechos comunes"]
[null,null,null,null,null,null,null,null,null,null,"Fregadero",1,"MG"]
[null,null,null,"INSTALACIONES","Estructura General ","INSTALACIÓN",1,"EG_01",null,"Requerido"]
[null,null,null,null,"Instalaciones Generales","INSTALACIÓN",1,"IG_01",null,"Requerido"]
[null,null,"Área para los Usuarios","AMBIENTES","Repostería","AMBIENTE",1,null,"Para construcciones nuevas deseable 12m2 ó dimensionar 1m2 por paciente y por puesto ","Condición","Lavabo",1,"MG",null,null,"Se justifica si tiene acceso directo a un lavabo"]
[null,null,null,null,null,null,null,null,null,null,"Dispensador de papel toalla",1,"MG",null,null,"Se justifica si tiene acceso directo a un lavabo"]
[null,null,null,null,null,null,null,null,null,null,"Dispensador de jabón",1,"MG",null,null,"Se justifica si tiene acceso directo a un lavabo"]
[null,null,null,null,null,null,null,null,null,null,"Basurero",1,"EG",null,null,"Recipiente para desechos comunes"]
[null,null,null,null,null,null,null,null,null,null,"Mesa ",1,"MG"]
[null,null,null,null,null,null,null,null,null,null,"Silla",4,"MG"]
[null,null,null,null,"Vestidor de pacientes","AMBIENTE",2,null,"Para construcciones nuevas deseable dimensionar  0,5m2 por puesto","Requerido","Casilleros/Lockers",5,"MG"]
[null,null,null,null,null,null,null,null,null,null,"Banco de vestuario",1,"MG"]
[null,null,null,null,null,null,null,null,null,null,"Gancho doble",1,"MG"]
[null,null,null,null,null,null,null,null,null,null,"Basurero",1,"MG",null,null,"Recipiente para desechos comunes"]
[null,null,null,null,"Baño de vestidor",null,2,null,null,"Requerido","Inodoro",1,"MG"]
[null,null,null,null,null,null,null,null,null,null,"Lavabo",1,"EG"]
[null,null,null,null,null,null,null,null,null,null,"Dispensador de papel toalla",1,"MG"]
[null,null,null,null,null,null,null,null,null,null,"Dispensador de jabón",1,"MG"]
[null,null,null,null,null,null,null,null,null,null,"Dispensador de papel higiénico",1,"MG"]
[null,null,null,null,null,null,null,null,null,null,"Espejo empotrado ",1,"MG"]
[null,null,null,null,null,null,null,null,null,null,"Gancho doble",1,"MG"]
[null,null,null,null,null,null,null,null,null,null,"Barras de apoyo",1,"EG"]
[null,null,null,null,null,null,null,null,null,null,"Basurero",2,"MG",null,null,"Recipientes para desechos comunes e infecciosos"]
[null,null,null,"INSTALACIONES","Estructura General ","INSTALACIÓN",1,"EG_01",null,"Requerido"]
[null,null,null,null,"Instalaciones Generales","INSTALACIÓN",1,"IG_01",null,"Requerido"]
["APOYO DIAGNÓSTICO","DIAGNÓSTICO EN LABORATORIO (LABORATORIO DE ANÁLISIS CLÍNICO) (En el caso de no contar con el servicio dentro del establecimiento debe existir un convenio con un Laboratorio de Análisis Clínico con permiso de funcionamiento emitido por el MSP; debe cumplir con las normas de transporte y conservación de muestras)","Área de Preanálisis","AMBIENTES","Toma de muestras","AMBIENTE",1,null,"Para construcciones nuevas deseable 5m2","Condición","Silla para toma de muestras",1,"MG"]
[null,null,null,null,null,null,null,null,null,null,"Mesa auxiliar",1,"MM"]
[null,null,null,null,null,null,null,null,null,null,"Set de recipientes para el manejo de desechos peligrosos y no peligrosos",1,"MG","EQ_07"]
[null,null,null,null,null,null,null,null,null,null,"Dispensador de papel toalla",1,"MG"]
[null,null,null,null,null,null,null,null,null,null,"Dispensador de jabón",1,"MG"]
[null,null,null,null,null,null,null,null,null,null,"Lavabo ",1,"MG"]
[null,null,null,null,null,null,null,null,null,null,"Taburete giratorio",1,"MG"]
[null,null,null,null,"Pre análisis","AMBIENTE",1,null," Para construcciones nuevas es requerido 2 m2 por puesto","Condición","Centrifuga",1,"EM"]
[null,null,null,null,null,null,null,null,null,null,"Silla",1,"MG"]
[null,null,null,null,null,null,null,null,null,null,"Canastilla/Coche para transporte de material",1,"MG"]
[null,null,null,null,null,null,null,null,null,null,"Set de recipientes para el manejo de desechos peligrosos y no peligrosos ",1,"MG","EQ_07"]
[null,null,null,"INSTALACIONES","Estructura General ","INSTALACIÓN",1,"EG_01",null,"Condición"]
[null,null,null,null,"Instalaciones Generales","INSTALACIÓN",1,"IG_01",null,"Condición"]
[null,null,"Área de Análisis","AMBIENTES","Hematología","AMBIENTE",1,null,"Para construcciones nuevas calcular según la demanda y el equipamiento","Requerido","Analizador Hematológico",1,"EM"]
[null,null,null,null,null,null,null,null,null,null,"Microscopio binocular",1,"EM"]
[null,null,null,null,null,null,null,null,null,null,"Agitador de tubos",1,"EM"]
[null,null,null,null,null,null,null,null,null,null,"Gradilla para tubos",2,"EM"]
[null,null,null,null,null,null,null,null,null,null,"Cámara de Neubauer",1,"EM"]
[null,null,null,null,null,null,null,null,null,null,"Contador diferencial para contaje de células(piano)",1,"EM"]
[null,null,null,null,null,null,null,null,null,null,"Micro centrifuga",1,"EM"]
[null,null,null,null,null,null,null,null,null,null,"Gradilla para velocidad de eritrosedimentación",1,"EM"]
[null,null,null,null,null,null,null,null,null,null,"Cronómetro",1,"EM"]
[null,null,null,null,null,null,null,null,null,null,"Silla para laboratorio",1,"EM"]
[null,null,null,null,null,null,null,null,null,null,"Lavabo",1,"MG",null,null,"Puede compartir con los otros ambientes de análisis"]
[null,null,null,null,null,null,null,null,null,null,"Dispensador  de jabón",1,"MG"]
[null,null,null,null,null,null,null,null,null,null,"Dispensador de papel toalla ",1,"MG"]
[null,null,null,null,null,null,null,null,null,null,"Set de recipientes para el manejo de desechos peligrosos y no peligrosos ",1,"MG","EQ_07"]
[null,null,null,null,"Química Clínica","AMBIENTE",1,null,"Para construcciones nuevas calcular según  demanda y equipamiento","Requerido","Equipo para química clínica",1,"EM"]
[null,null,null,null,null,null,null,null,null,null,"Gradillas para tubos",1,"EM"]
[null,null,null,null,null,null,null,null,null,null,"Pipetas semiautomáticas variables o fijas 5 a 1000UL",1,"EM"]
[null,null,null,null,null,null,null,null,null,null,"Set de recipientes para el manejo de desechos peligrosos y no peligrosos ",1,"MG","EQ_07","Condición","Puede estar centralizado"]
[null,null,null,null,null,null,null,null,null,null,"Silla para laboratorio",1,"MG"]
[null,null,null,null," Hemostasia","AMBIENTE",1,null,"Para construcciones nuevas calcular según  demanda y equipamiento","Requerido","Equipo para coagulación",1,"EM",null,"Condición"]
[null,null,null,null,null,null,null,null,null,null,"Baño  maría",1,"EM",null,"Condición","Puede estar compartido y es una condición cuando viene incluido en el equipo de coagulación"]
[null,null,null,null,null,null,null,null,null,null,"Gradilla para tubos",1,"EM"]
[null,null,null,null,null,null,null,null,null,null,"Cronómetro",1,"EG"]
[null,null,null,null,null,null,null,null,null,null,"Silla para laboratorio",1,"MG"]
[null,null,null,null,null,null,null,null,null,null,"Set de recipientes para el manejo de desechos peligrosos y no peligrosos ",1,"MG","EQ_07","Condición","Puede estar centralizado"]
[null,null,null,null,"Uroanálisis y Coproanálisis","AMBIENTE",1,null," Para construcciones nuevas calcular según  demanda y  equipamiento","Condición","Analizador automático de tiras de orina",1,"EM"]
[null,null,null,null,null,null,null,null,null,null,"Analizador automático microscopico de orina",1,"EM"]
[null,null,null,null,null,null,null,null,null,null,"Microscopio binocular",1,"EM"]
[null,null,null,null,null,null,null,null,null,null,"Centrifuga",1,"EM"]
[null,null,null,null,null,null,null,null,null,null,"Gradillas para tubos",1,"EM"]
[null,null,null,null,null,null,null,null,null,null,"Silla para laboratorio",1,"MG"]
[null,null,null,null,null,null,null,null,null,null,"Fregadero",1,"MG"]
[null,null,null,null,null,null,null,null,null,null,"Set de recipientes para el manejo de desechos peligrosos y no peligrosos ",1,"MG","EQ_07"]
[null,null,null,null,null,null,null,null,null,null,"Dispensador de papel toalla ",1,"MG"]
[null,null,null,null,null,null,null,null,null,null,"Dispensador  de jabón",1,"MG"]
[null,null,null,null,"Microbiología de mediana complejidad","AMBIENTE",1,null,"Para construcciones nuevas calcular según la demanda y el equipamiento ","Condición","Microscopio binocular",1,"EM"]
[null,null,null,null,null,null,null,null,null,null,"Contador diferencial para contaje de células(piano)",1,"EM"]
[null,null,null,null,null,null,null,null,null,null,"Gradillas para placas",1,"EG"]
[null,null,null,null,null,null,null,null,null,null,"Cámara de Neubauer",1,"EM"]
[null,null,null,null,null,null,null,null,null,null,"Coloreador de placas automatizado",1,"EM"]
[null,null,null,null,null,null,null,null,null,null,"Incinerador de asas",1,"EM"]
[null,null,null,null,null,null,null,null,null,null,"Rejilla para tinción de placas",1,"EG"]
[null,null,null,null,null,null,null,null,null,null,"Mechero",1,"EG"]
[null,null,null,null,null,null,null,null,null,null,"Fregadero",1,"MG"]
[null,null,null,null,null,null,null,null,null,null,"Silla para laboratorio",1,"MG"]
[null,null,null,null,null,null,null,null,null,null,"Set de recipientes para el manejo de desechos peligrosos y no peligrosos ",1,"MG","EQ_07"]
[null,null,null,null,null,null,null,null,null,null,"Dispensador de papel toalla ",1,"MG"]
[null,null,null,null,null,null,null,null,null,null,"Dispensador  de jabón",1,"MG"]
[null,null,null,null,"Inmunología e Inmunoquímica","AMBIENTE",1,null," Para construcciones nuevas calcular según  demanda y  equipamiento","Requerido","Analizador automático para inmunología",1,"EM"]
[null,null,null,null,null,null,null,null,null,null,"Analizador automático para ELISA",1,"EM"]
[null,null,null,null,null,null,null,null,null,null,"Lector de microplacas para ELISA",1,"EM"]
[null,null,null,null,null,null,null,null,null,null,"Analizador automático para inmunoquímica",1,"EM"]
[null,null,null,null,null,null,null,null,null,null,"Estufa ",1,"EG"]
[null,null,null,null,null,null,null,null,null,null,"Lavador de microplacas para ELISA",1,"EM"]
[null,null,null,null,null,null,null,null,null,null,"Centrifuga",1,"EM"]
[null,null,null,null,null,null,null,null,null,null,"Vórtex",1,"EM"]
[null,null,null,null,null,null,null,null,null,null,"Nefelómetro",1,"EM"]
[null,null,null,null,null,null,null,null,null,null,"Turbidímetro para inmunología",1,"EM"]
[null,null,null,null,null,null,null,null,null,null,"Gradillas para tubos",2,"EM"]
[null,null,null,null,null,null,null,null,null,null,"Pipetas semiautomaticas variables o fijas 5 a 1000UL",1,"EM"]
[null,null,null,null,null,null,null,null,null,null,"Cronómetro",1,"EM"]
[null,null,null,null,null,null,null,null,null,null,"Agitador lineal",1,"EM"]
[null,null,null,null,null,null,null,null,null,null,"Silla para laboratorio",1,"EG"]
[null,null,null,null,null,null,null,null,null,null,"Set de recipientes para el manejo de desechos peligrosos y no peligrosos. ",1,"EM","EQ_07"]
[null,null,null,null,null,null,null,null,null,null,"Microscopio binocular",1,"EM"]
[null,null,null,null,null,null,null,null,null,null,"Placas para VDRL",1,"EM"]
[null,null,null,null,null,null,null,null,null,null,"Placas cóncavas",1,"EM"]
[null,null,null,null,null,null,null,null,null,null,"Refrigeradora de 2 a 8 ºC con termómetro",1,"EG"]
[null,null,null,null,null,null,null,null,null,null,"Termohigrómetro ambiental",1,"EG"]
[null,null,null,null,"Área para Bioseguridad laboral","AMBIENTE",1,null,"Para construcciones nuevas requerido 0,8 m2","Requerido","Lavaojos",1,"MM"]
[null,null,null,"INSTALACIONES","Estructura General ","INSTALACIÓN",1,"EG_01",null,"Requerido"]
[null,null,null,null,"Instalaciones Generales","INSTALACIÓN",1,"IG_01",null,"Requerido"]
[null,null,"Área de soporte","AMBIENTES","Zona de Refrigeradores y Congeladores","AMBIENTE",1,null,"Para construcciones nuevas calcular según demanda funcional ","Requerido","Refrigerador con congelador ",1,"EG"]
[null,null,null,null,null,null,null,null,null,null,"Termómetro",1,"EG",null,null,"Deseable que sea digital"]
[null,null,null,null,"Bodega o almacenamiento de Material ","AMBIENTE",1,null," Para construcciones nuevas calcular según demanda funcional ","Requerido","Estantería",1,"MG"]
[null,null,null,null,null,null,null,null,null,null,"Escalera pata de gallo / Gradilla",1,"MG",null,"Condición","Si es que tiene estanterías altas que no sean accesibles al operador/funcionario/usuario"]
[null,null,null,null,null,null,null,null,null,null,"Stock de Reactivos de Laboratorio",1,"EM","EQ_44"]
[null,null,null,null,null,null,null,null,null,null,"Refrigerador",1,"EG",null,"Condición"]
[null,null,null,null,null,null,null,null,null,null,"Termómetro",1,"EG",null,null,"Deseable que sea digital"]
[null,null,null,null,"Usado.\n(para lavado y esterilización de material)","AMBIENTE",1,null,"Para construcciones nuevas calcular según demanda, mínimo requerido 2,4 m2. .","Condición","Fregadero",1,"MG"]
[null,null,null,null,null,null,null,null,null,null,"Set de recipientes para el manejo de desechos peligrosos y no peligrosos ",1,"MG","EQ_07"]
[null,null,null,null,null,null,null,null,null,null,"Canastilla/Coche de transporte de muestras",1,"MM"]
[null,null,null,null,null,null,null,null,null,null,"Esterilizador a vapor/seco",1,"EM",null,"Condición"]
[null,null,null,null,null,null,null,null,null,null,"Dispensador de papel toalla ",1,"MG"]
[null,null,null,null,null,null,null,null,null,null,"Dispensador  de jabón",1,"MG"]
[null,null,null,null,"Cuarto de Limpieza","AMBIENTE",1,null,"Para construcciones nuevas calcular según demanda funcional, mínimo requerido 2 m2; puede compartir con otro servicio o estar centralizado. ","Requerido","Coche de limpieza ",1,"MG"]
[null,null,null,null,null,null,null,null,null,null,"Stock de insumos de limpieza ",1,"MG"]
[null,null,null,null,null,null,null,null,null,null,"Estantería ",1,"MG"]
[null,null,null,null,null,null,null,null,null,null,"Lavadero con poza profunda para el preparado y enjuague de los útiles de limpieza",1,"MG"]
[null,null,null,"INSTALACIONES","Estructura General","INSTALACION",1,"EG_01",null,"Requerido"]
[null,null,null,null,"Instalaciones Generales","INSTALACION",1,"IG_01",null,"Requerido"]
[null,null,"Área Administrativa y de Personal","AMBIENTES","Despacho de Responsable de Servicio","AMBIENTE",1,null,"Para construcciones nuevas requerido 10 m2","Condición","Escritorio/ Mesa de despacho  ",1,"MG","EQ_01"]
[null,null,null,null,null,null,null,null,null,null,"Armario/Archivador",1,"MG"]
[null,null,null,null,null,null,null,null,null,null,"Computador completo (Portátil o de Escritorio)",1,"EG","EQ_02"]
[null,null,null,null,null,null,null,null,null,null,"Basurero ",1,"MG",null,null,"Recipiente para desechos comunes"]
[null,null,null,null,null,null,null,null,null,null,"Perchero de pie /Gancho doble",1,"MG",null,"Deseable"]
[null,null,null,null,null,null,null,null,null,null,"Silla Confidente ",2,"MG"]
[null,null,null,null,null,null,null,null,null,null,"Silla",1,"MG"]
[null,null,null,"INSTALACIONES","Estructura General","INSTALACION",1,"EG_01",null,"Condición"]
[null,null,null,null,"Instalaciones Generales","INSTALACION",1,"IG_01",null,"Condición"]
["APOYO TERAPÉUTICO","DOTACIÓN DE MEDICAMENTOS Y DISPOSITIVOS MÉDICOS (FARMACIA)","Área de Farnacia","AMBIENTES","Dispensación","AMBIENTE",1,null,"Para construcciones nuevas calcular según demanda funcional.","Requerido","Mostrador/Escritorio",1,"MG","EQ_01"]
[null,null,null,null,null,null,null,null,null,null,"Computador completo (Portátil o de Escritorio)",1,"EG","EQ_02"]
[null,null,null,null,null,null,null,null,null,null,"Silla",1,"MG"]
[null,null,null,null,null,null,null,null,null,null,"Armario con seguridad",1,"MM",null,"Condición","Será requerido en el caso que tenga medicamentos que contienen sustancias estupefacientes y/o psicótropicas"]
[null,null,null,null,null,null,null,null,null,null,"Estantería ",1,"MG"]
[null,null,null,null,null,null,null,null,null,null,"Refrigerador con termo higrómetro",1,"EG",null,"Condición","Será requerido en el caso de contar con medicamentos que requieran mantener cadena de frío"]
[null,null,null,null,null,null,null,null,null,null,"Termo higrómetro ambiental",1,"EG"]
[null,null,null,null,null,null,null,null,null,null,"Basurero",2,"MG",null,null,"Recipientes para desechos no peligrosos - comunes y peligrosos - especiales"]
[null,null,null,null,null,null,null,null,null,null,"Lavabo",1,"MG",null,null,"Puede estar en otro ambiente pero se tiene que asegurar la bioseguridad pasiva"]
[null,null,null,null,null,null,null,null,null,null,"Dispensador  de jabón",1,"MG",null,null,"Puede estar en otro ambiente pero se tiene que asegurar la bioseguridad pasiva"]
[null,null,null,null,null,null,null,null,null,null,"Dispensador de papel toalla ",1,"MG",null,null,"Puede estar en otro ambiente pero se tiene que asegurar la bioseguridad pasiva"]
[null,null,null,null,"Bodega","AMBIENTE",1,null,"Para construcciones nuevas calcular según demanda funcional","Requerido","Estantería ",1,"MG"]
[null,null,null,null,null,null,null,null,null,null,"Pallet",1,"MG",null,null,"Según la normativa"]
[null,null,null,null,null,null,null,null,null,null,"Refrigerador con termo higrómetro",1,"EG",null,"Condición","Será requerido en el caso de contar con medicamentos que requieran mantener cadena de frío"]
[null,null,null,null,null,null,null,null,null,null,"Termo higrómetro ambiental",1,"EG"]
[null,null,null,null,null,null,null,null,null,null,"Extintor de incendios  portátil  ",1,"EG",null,null,"La especificación será según normativa"]
[null,null,null,null,null,null,null,null,null,null,"Escalera pata de gallo / Gradilla",1,"MG",null,null,"Si es que tiene estanterías altas que no sean accesibles al operador/funcionario/usuario"]
[null,null,null,"INSTALACIONES","Estructura General ","INSTALACIÓN",1,"EG_01",null,"Requerido"]
[null,null,null,null,"Instalaciones Generales","INSTALACIÓN",1,"IG_01",null,"Requerido"]
["ADMINISTRATIVO","ADMINISTRACIÓN TÉCNICA","Área Técnica","AMBIENTES","Despacho del Director (Puede ser un consultorio médico de uso exclusivo del director [Nefrólogo])","AMBIENTE",1,null,"Para construcciones nuevas deseable 13m2","Requerido","Escritorio/Mesa de despacho",1,"MG","EQ_01"]
[null,null,null,null,null,null,null,null,null,null,"Armario/Archivador",1,"MM"]
[null,null,null,null,null,null,null,null,null,null,"Computador completo (Portátil o de Escritorio)",1,"EM","EQ_02"]
[null,null,null,null,null,null,null,null,null,null,"Basurero",1,"MG",null,null,"Recipiente para desechos comunes"]
[null,null,null,null,null,null,null,null,null,null,"Perchero de pie/Gancho doble",1,"MG"]
[null,null,null,null,null,null,null,null,null,null,"Silla confidente ",2,"MG"]
[null,null,null,null,null,null,null,null,null,null,"Silla",1,"MG"]
[null,null,null,null,"Sala de espera","AMBIENTE",1,null,"Para construcciones nuevas deseable 9 m2","Condición","Bancas / sillas",2,"MM",null,null,"Mínimo contar con 6 puestos para la sala de espera (bancas en tándem o sillas o sillones)"]
[null,null,null,null,null,null,null,null,null,null,"Basurero",1,"MG",null,null,"Recipiente para desechos comunes"]
[null,null,null,null,null,null,null,null,null,null,"Reloj de pared",1,"MG"]
[null,null,null,null,"Secretaría (no exclusiva de la Dirección, puede encontrarse en el área de Admisión, Información y Recepción)","AMBIENTE",1,null,"Para construcciones nuevas deseable 8m2","Requerido","Escritorio/Mesa de despacho",1,"MG","EQ_01"]
[null,null,null,null,null,null,null,null,null,null,"Armario/Archivador",1,"MM"]
[null,null,null,null,null,null,null,null,null,null,"Basurero",1,"MG",null,null,"Recipiente para desechos comunes"]
[null,null,null,null,null,null,null,null,null,null,"Perchero de pie/Gancho doble",1,"MG"]
[null,null,null,null,null,null,null,null,null,null,"Silla confidente",2,"MG"]
[null,null,null,null,null,null,null,null,null,null,"Silla",1,"MG"]
[null,null,null,null,"Oficina de  Trabajo Social (Puede compartir con los Consultorios de Psicología y Nutrición, únicamente cuando esta se encuentre en consulta externa. Es un área de uso exclusivo que debe asegurar la privacidad del usuario)","AMBIENTE",1,null,"Para construcciones nuevas deseable 12m2","Requerido","Escritorio/Mesa de despacho",1,"MG","EQ_01"]
[null,null,null,null,null,null,null,null,null,null,"Computador completo (Portátil o de escritorio)",1,"EM","EQ_02"]
[null,null,null,null,null,null,null,null,null,null,"Armario/Vitrina/Archivador",1,"MG"]
[null,null,null,null,null,null,null,null,null,null,"Basurero",1,"MG",null,null,"Recipiente para desechos comunes"]
[null,null,null,null,null,null,null,null,null,null,"Dispensador para solución hidroalcohólica",1,"MG"]
[null,null,null,null,null,null,null,null,null,null,"Silla confidente",2,"MG"]
[null,null,null,null,null,null,null,null,null,null,"Silla",1,"MG"]
[null,null,null,null,"Despacho de Jefe de Enfermeras","AMBIENTE",1,null,"Para construcciones nuevas deseable 8m2","Requerido","Escritorio/Mesa de despacho",1,"MG","EQ_01"]
[null,null,null,null,null,null,null,null,null,null,"Armario/Archivador",1,"MM"]
[null,null,null,null,null,null,null,null,null,null,"Computador completo (Portátil o de Escritorio)",1,"EG","EQ_02"]
[null,null,null,null,null,null,null,null,null,null,"Basurero",1,"MG",null,null,"Recipiente para desechos comunes"]
[null,null,null,null,null,null,null,null,null,null,"Perchero de pie/Gancho doble",1,"MG"]
[null,null,null,null,null,null,null,null,null,null,"Silla",2,"MG"]
[null,null,null,null,"Despacho de Responsable de Talento Humano (Puede estar en un ambiente compartido con la Zona de Trabajo de técnico financiero, debe demostrarse la gestión)","AMBIENTE",1,null,"Para construcciones nuevas deseable 8m2","Condición","Escritorio/Mesa de despacho",1,"MG","EQ_01"]
[null,null,null,null,null,null,null,null,null,null,"Armario/Archivador",1,"MG"]
[null,null,null,null,null,null,null,null,null,null,"Computador completo (Portátil o de Escritorio)",1,"EG","EQ_02"]
[null,null,null,null,null,null,null,null,null,null,"Basurero",1,"MG",null,null,"Recipiente para desechos comunes"]
[null,null,null,null,null,null,null,null,null,null,"Perchero de pie/Gancho doble",1,"MG"]
[null,null,null,null,null,null,null,null,null,null,"Silla confidente",2,"MG"]
[null,null,null,null,null,null,null,null,null,null,"Silla",1,"MG"]
[null,null,null,null,"Zona de trabajo de Técnico financiero","AMBIENTE",1,null,"Para construcciones nuevas deseable 6m2","Condición","Escritorio/Mesa de despacho",1,"MG","EQ_01"]
[null,null,null,null,null,null,null,null,null,null,"Armario/Archivador",1,"MG"]
[null,null,null,null,null,null,null,null,null,null,"Computador completo (Portátil o de Escritorio)",1,"EG","EQ_02"]
[null,null,null,null,null,null,null,null,null,null,"Basurero",1,"MG",null,null,"Recipiente para desechos comunes"]
[null,null,null,null,null,null,null,null,null,null,"Perchero de pie/Gancho doble",1,"MG"]
[null,null,null,null,null,null,null,null,null,null,"Silla",1,"MG"]
[null,null,null,null,"Baño de personal","AMBIENTE",2,null,"Para construcciones nuevas deseable 4m2","Requerido","Dispensador de jabón",1,"MG"]
[null,null,null,null,null,null,null,null,null,null,"Dispensador de papel toalla",1,"MG",null,null,"Se justifica si cuenta con secador de manos"]
[null,null,null,null,null,null,null,null,null,null,"Dispensador papel higiénico",1,"MG"]
[null,null,null,null,null,null,null,null,null,null,"Espejo empotrado ",1,"MG"]
[null,null,null,null,null,null,null,null,null,null,"Gancho doble",1,"MG"]
[null,null,null,null,null,null,null,null,null,null,"Lavabo ",1,"MG"]
[null,null,null,null,null,null,null,null,null,null,"Basurero",1,"MG",null,null,"Recipiente para desechos comunes"]
[null,null,null,null,null,null,null,null,null,null,"Barras de apoyo",1,"MG",null,"Condición","Requerido en el caso de contar con personal con discapacidad"]
[null,null,null,"INSTALACIONES","Estructura General ","INSTALACIÓN",1,"EG_01",null,"Requerido"]
[null,null,null,null,"Instalaciones Generales","INSTALACIÓN",1,"IG_01",null,"Requerido"]
["GENERAL","SERVICIOS INTERNOS DE APOYO","Área de Apoyo y  almacenamiento ( suministros e insumos) para el establecimiento","AMBIENTES","Recepción-Admisión","AMBIENTE",1,null,"Para construcciones nuevas deseable 6 m2","Condición","Mostrador / escritorio/Mesa de despacho",1,"MG","EQ_01"]
[null,null,null,null,null,null,null,null,null,null,"Armario/Archivador",1,"MG"]
[null,null,null,null,null,null,null,null,null,null,"Computador completo (Portátil o de Escritorio)",1,"EG","EQ_02","Condición"]
[null,null,null,null,null,null,null,null,null,null,"Basurero",1,"MG",null,null,"Recipiente para desechos comunes"]
[null,null,null,null,null,null,null,null,null,null,"Silla",1,"MG"]
[null,null,null,null,null,null,null,null,null,null,"Tablero de avisos ",1,"MG"]
[null,null,null,null,null,null,null,null,null,null,"Teléfono",1,"EG",null,"Condición"]
[null,null,null,null,"Bodega General","AMBIENTE",1,null,"Para construcciones nuevas deseable 30 m2, dimensionar en función del tamaño del Centro y la accesibilidad geográfica","Requerido","Escalera pata de gallo/Gradilla",1,"MG",null,null,"Si dispone de estanterías con altura que no sea de alcance para el funcionario"]
[null,null,null,null,null,null,null,null,null,null,"Extintor de incendios portátil",1,"MG",null,null,"Según normativa"]
[null,null,null,null,null,null,null,null,null,null,"Estantería",2,"MG"]
[null,null,null,"INSTALACIONES","Estructura General ","INSTALACIÓN",1,"EG_01",null,"Requerido"]
[null,null,null,null,"Instalaciones Generales","INSTALACIÓN",1,"IG_01",null,"Requerido"]
[null,null,"Área del Personal","AMBIENTES","Vestidor","AMBIENTE",2,null,"Para construcciones nuevas deseable con baño, ajustar el 60% de la plantilla, dimensionar 0,5m2 por persona. Mínimo 10m2","Requerido","Casilleros/Lockers",5,"MG"]
[null,null,null,null,null,null,null,null,null,null,"Banco de vestuario",1,"MG"]
[null,null,null,null,null,null,null,null,null,null,"Gancho doble",1,"MG"]
[null,null,null,null,null,null,null,null,null,null,"Basurero",1,"MG",null,null,"Recipiente para desechos comunes"]
[null,null,null,null,"Baño de vestidor","AMBIENTE",2,null,null,"Requerido","Dispensador de jabón",1,"MG"]
[null,null,null,null,null,null,null,null,null,null,"Dispensador de papel toalla",1,"MG"]
[null,null,null,null,null,null,null,null,null,null,"Dispensador de papel higiénico",1,"MG"]
[null,null,null,null,null,null,null,null,null,null,"Inodoro",1,"MG"]
[null,null,null,null,null,null,null,null,null,null,"Espejo empotrado ",1,"MG"]
[null,null,null,null,null,null,null,null,null,null,"Gancho doble",1,"MG"]
[null,null,null,null,null,null,null,null,null,null,"Barras de apoyo",1,"MG",null,"Deseable"]
[null,null,null,null,null,null,null,null,null,null,"Lavabo ",1,"MG"]
[null,null,null,null,null,null,null,null,null,null,"Basurero",1,"MG",null,null,"Recipiente para desechos comunes"]
[null,null,null,null,"Cafetería","AMBIENTE",1,null,"Para construcciones nuevas 4m2","Condición","Mesa",1,"MG"]
[null,null,null,null,null,null,null,null,null,null,"Cafetera ",1,"EG"]
[null,null,null,null,null,null,null,null,null,null,"Gancho doble",1,"MG"]
[null,null,null,null,null,null,null,null,null,null,"Mesón con Lavabo",1,"MG"]
[null,null,null,null,null,null,null,null,null,null,"Microondas",1,"EG"]
[null,null,null,null,null,null,null,null,null,null,"Silla",4,"MG"]
[null,null,null,null,"Sala de reuniones","AMBIENTE",1,null,"Para construcciones nuevas deseable 16 m2","Condición","Mesa de reuniones",1,"MG"]
[null,null,null,null,null,null,null,null,null,null,"Computador completo (Portátil o de Escritorio)",1,"EG","EQ_02","Condición"]
[null,null,null,null,null,null,null,null,null,null,"Mueble para computadora",1,"MG",null,"Condición"]
[null,null,null,null,null,null,null,null,null,null,"Proyector multimedia",1,"EG"]
[null,null,null,null,null,null,null,null,null,null,"Silla",4,"MG"]
[null,null,null,null,null,null,null,null,null,null,"Archivador",1,"MG"]
[null,null,null,"INSTALACIONES","Estructura General ","INSTALACIÓN",1,"EG_01",null,"Requerido"]
[null,null,null,null,"Instalaciones Generales","INSTALACIÓN",1,"IG_01",null,"Requerido"]
[null,null,"Limpieza","AMBIENTES","Bodega (Puede encontrarse dentro de la bodega general, pero en un área diferenciada)","AMBIENTE",1,null,null,"Requerido","Estantería",1,"MG"]
[null,null,null,null,"Cuarto de Limpieza (será requerido en el caso de no contar con cuartos de limpieza en los servicios que lo requieran) ","AMBIENTE",1,null,"Para construcciones nuevas deseable 2m2","Condición","Coche de limpieza",1,"MG"]
[null,null,null,null,null,null,null,null,null,null,"Stock de Insumos de Limpieza",1,"EG","EQ_05"]
[null,null,null,null,null,null,null,null,null,null,"Estantería",1,"MG"]
[null,null,null,null,null,null,null,null,null,null,"Lavadero con poza profunda para el preparado y enjuague de los útiles de limpieza",1,"MG"]
[null,null,null,null,"Vestidor (Será requerido en el caso de que en el vestidor del área de personal no se ha previsto un espacio exclusivo para el personal de limpieza)","AMBIENTE",1,null,"Para construcciones nuevas deseable con baño, ajustar el 60% de la plantilla, dimensionar 0,5m2 por persona.","Condición","Casilleros/Lockers",5,"MG"]
[null,null,null,null,null,null,null,null,null,null,"Banco de vestuario",1,"MG"]
[null,null,null,null,null,null,null,null,null,null,"Gancho doble",1,"MG"]
[null,null,null,null,null,null,null,null,null,null,"Basurero",1,"MG",null,null,"Recipiente para desechos comunes"]
[null,null,null,null,"Baño de vestidor","AMBIENTE",1,null,null,"Condición","Dispensador de jabón",1,"MG"]
[null,null,null,null,null,null,null,null,null,null,"Dispensador de papel toalla",1,"MG"]
[null,null,null,null,null,null,null,null,null,null,"Dispensador de papel higiénico",1,"MG"]
[null,null,null,null,null,null,null,null,null,null,"Inodoro",1,"MG"]
[null,null,null,null,null,null,null,null,null,null,"Espejo empotrado ",1,"MG"]
[null,null,null,null,null,null,null,null,null,null,"Gancho doble",1,"MG"]
[null,null,null,null,null,null,null,null,null,null,"Barras de apoyo",1,"MG",null,"Deseable"]
[null,null,null,null,null,null,null,null,null,null,"Lavabo ",1,"MG"]
[null,null,null,null,null,null,null,null,null,null,"Basurero",1,"MG",null,null,"Recipiente para desechos comunes"]
[null,null,null,"INSTALACIONES","Estructura General ","INSTALACIÓN",1,"EG_01",null,"Requerido"]
[null,null,null,null,"Instalaciones Generales","INSTALACIÓN",1,"IG_01",null,"Requerido"]
[null,null,"Almacenamiento Final de Desechos","AMBIENTES","Área de Almacenamiento de Desechos no peligrosos - Comunes","AMBIENTE",1,null,"Para construcciones nuevas calcular según demanda funcional. (cantidades generadas) ","Requerido","Contenedor ",1,"MG"]
[null,null,null,null,"Área de Almacenamiento de Desechos Peligrosos- Infecciosos","AMBIENTE",1,null,"Para construcciones nuevas calcular según demanda funcional. (cantidades generadas) ","Requerido","Contenedor ",1,"MG"]
[null,null,null,null,"Área de Desechos Peligrosos- Especiales","AMBIENTE",1,null,"Para construcciones nuevas calcular según demanda funcional. (cantidades generadas) ","Requerido","Contenedor ",1,"MG"]
[null,null,null,"INSTALACIONES","Estructura General ","INSTALACIÓN",1,"EG_01",null,"Requerido"]
[null,null,null,null,"Instalaciones Generales","INSTALACIÓN",1,"IG_01",null,"Requerido"]
["NOTA GENERAL.- Para construcciones nuevas, las áreas se calcularán según el tipo del establecimiento y las demandas funcionales del espacio, respetando las normas nacionales existentes (INEN, Código Ecuatoriano de Construcción, Ordenanzas, etc.) y las internacionales que apliquen cuando las nacionales no son suficientes. Tomar en cuenta equipamiento y personal que lo maneja así como la cantidad de usuarios del espacio en los momentos críticos o de mayor demanda. "]
[]
[]
[]
["INSTALACIONES DEL LOCAL","Estructura General",null,"Áreas adecuadas para el tránsito de sillas de ruedas",null,"INSTALACION",null,null,null,"Requerido"]
[null,"Instalaciones eléctricas generales (iluminación y fuerza)",null,"Red de tomas de energía",null,"INSTALACION",1,null,null,"Requerido"]
[null,null,null,"Red de instalaciones para iluminación",null,"INSTALACION",1,null,null,"Requerido"]
[null,null,null,"Acometidas Eléctricas  (tableros de control - interruptores termomagnéticos-)",null,"INSTALACION",1,null,null,"Requerido"]
[null,null,null,"Sistema de soporte de energía eléctrica  de emergencia. (Generación o respaldo de baterías generales o individuales)",null,"INSTALACION",1,null,null,"Condición"]
[null,null,null,"Instalaciones de pararrayos",null,"INSTALACION",1,null,"Según estudios de especialista","Condición"]
[null,"Instalaciones electrónicas",null,"Sensores y alarmas para incendios",null,"INSTALACION",1,null,null,"Requerido"]
[null,null,null,"Sistema de audio centralizado",null,"INSTALACION",1,null,null,"Condición"]
[null,"Instalaciones de telecomunicaciones",null,"Instalaciones telefónicas convencionales",null,"INSTALACION",1,null,null,"Requerido"]
[null,null,null,"Suministro de Internet ",null,"INSTALACION",1,null,null,"Requerido"]
[null,"Instalaciones de abastecimiento de agua",null,"Reservorio y sistema de provisión de agua potable para casos de  emergencia por falta de provisión normal de la misma. Ejem: Cisterna/tanques ",null,"INSTALACION",1,null,null,"Requerido"," "]
[null,null,null,"Instalaciones de agua fría",null,"INSTALACION",1,null,null,"Requerido"]
[null,null,null,"Instalaciones de agua caliente",null,"INSTALACION",1,null,null,"Condición"]
[null,"Instalaciones de desagüe",null,"Red de instalaciones internas de recolección y conducción de aguas servidas.",null,"INSTALACION",1,null,null,"Requerido"]
[null,"Instalaciones mecánicas generales",null,"Sistemas centralizados de aire acondicionado. Enfriadores(Chillers)-Unidades manejadoras de aire (UMAS)",null,"INSTALACION",1,null,"Será requerido en áreas geográficas con condiciones ambientales desfavorables ","Condición"]
[null,null,null,"Redes de ductos de aire acondicionado y/o ventilación/extracción",null,"INSTALACION",1,null,null,"Condición"]
[null,"Instalaciones generales",null,"Instalaciones de ascensores (circulación vertical)",null,"INSTALACION",1,null,"Será requerido en caso de tener más de una planta y se realice atención asistencial o procedimientos a los pacientes desde la  segunda planta arquitectónica, se requerirá como mínimo un monta camillas o como alternativa el diseño de rampa","Condición"]
[null,null,null,"Sistema de ventilación",null,"INSTALACION",1,null,"Puede ser ventilación artificial (ventiladores/extractores) o natural (ventanería)","Requerido"]
[null,null,null,"Señalización externa e interna",null,"INSTALACION",1,null,null,"Requerido"]

{"sheet":"BaseTalentoHumano","index":1,"n_rows":25,"n_cols":13,"rows_kept":25,"cut":false,"hidden":false,"merged":[[19,4,22,4],[19,5,22,5],[23,3,24,3],[23,4,24,4],[15,4,16,4],[15,5,16,5],[17,3,18,3],[17,4,18,4],[17,5,18,5],[15,3,16,3],[19,3,22,3],[2,3,2,12],[5,3,8,3],[5,4,8,4],[5,5,8,5],[9,3,14,3],[9,4,14,4],[9,5,11,5],[12,5,14,5]]}
[]
[]
[null,null,null," CENTRO ESPECIALIZADO EN DIÁLISIS PERITONEAL"]
[null,null,null,"GRUPO 00","GRUPO 01","GRUPO 02","Personal","Tipo Personal","Cant Mínima","Por Puestos / Pacientes / Servicios / Turnos","ANEXO","Observaciones","TIPO"]
[null,null,null,"ADMINISTRATIVO","ADMISIÓN Y ESTADISTICA","Área Técnica","Analista de Admisiones y Estadísticas","ADMINISTRATIVO",1,null,null,null,"Requerido"]
[null,null,null,"ASISTENCIAL","CONSULTA EXTERNA","Área de Atención de Consulta","Licenciada/o en Enfermería ","ASISTENCIAL",1,null,null,"Requerida en el caso de haber más de 5 consultorios médicos","Condición"]
[null,null,null,null,null,null,"Médico Especialista en Nefrología","ASISTENCIAL",1,null,null,"Puede ser el mismo director médico","Requerido"]
[null,null,null,null,null,null,"Psicologo  Clínico","ASISTENCIAL",1,null,null,null,"Requerido"]
[null,null,null,null,null,null,"Nutricionista","ASISTENCIAL",1,null,null,null,"Requerido"]
[null,null,null,"APOYO TERAPÉUTICO","ATENCIÓN DE APOYO TERAPÉUTICO","Área de Procedimientos","Médico Especialista en Cirugía Digestiva o en Cirugía General con experiencia en colocación de catéteres peritoneales","ASISTENCIAL",1,null,null,"Será requerido en el caso de que realice inserción de catéteres","Condición"]
[null,null,null,null,null,null,"Licenciada/o en Enfermería con experiencia en instrumentación","ASISTENCIAL",1,null,null,"Será requerido en el caso de que realice inserción de catéteres","Condición"]
[null,null,null,null,null,null,"Auxiliar o Asistente  de Enfermería","ASISTENCIAL",1,null,null,"Será requerido en el caso de que realice inserción de catéteres","Condición"]
[null,null,null,null,null,"Área de Diálisis Peritoneal","Médico Tratante especialista en Nefrología o cualquier Médico con experiencia mínima de 2 años en servicios de diálisis y/o certificados avalizados por la Sociedad de Nefrología, Diálisis Y Trasplantes y/o Universidades acreditadas, notarizados) (1 profesional por cada 50 pacientes)","ASISTENCIAL",1,50,null,null,"Requerido"]
[null,null,null,null,null,null,"Licenciada/o en Enfermería con experiencia en servicios de diálisis y/o certificados avalizados por la Sociedad de Nefrología, Diálisis Y Trasplantes y/o Universidades acreditadas, notarizados) (1 profesional por cada 50 pacientes)","ASISTENCIAL",1,50,null,null,"Requerido"]
[null,null,null,null,null,null,"Auxiliar o Asistente  de Enfermería (1 por cada 14 pacientes) (personal de enfermería con experiencia en diálisis)","ASISTENCIAL",1,14,null,null,"Requerido"]
[null,null,null,"APOYO DIAGNÓSTICO","DIAGNÓSTICO EN LABORATORIO (LABORATORIO DE ANÁLISIS CLÍNICO)","Área de Análisis","Tecnólogo /Licenciado en Laboratorio Clínico","ASISTENCIAL",1,null,null,"Será requerido en el caso de contar con el LAC","Condición"]
[null,null,null,null,null,null,"Auxiliar de Laboratorio ","ADMINISTRATIVO",1,null,null,"Será requerido en el caso de contar con el LAC","Condición"]
[null,null,null,"APOYO TERAPÉUTICO","DOTACIÓN DE MEDICAMENTOS Y DISPOSITIVOS MÉDICOS (FARMACIA)","Área de Farmacia","Químico / Bioquímico / Farmacéutico","ADMINISTRATIVO",1,null,null,"Puede ser itinerante","Requerido"]
[null,null,null,null,null,null,"Asistente de Farmacia ","ASISTENCIAL",1,null,null,"Puede ser el mismo auxiliar de servicios","Requerido"]
[null,null,null,"ADMINISTRATIVO","ADMINISTRACIÓN TÉCNICA","Área Técnica","Director Médico (Médico espcialista en Nefrología)","ADMINISTRATIVO",1,null,null,"Puede ser el mismo encargado de dar la prestación de consulta externa","Requerido"]
[null,null,null,null,null,null,"Secretaria","ADMINISTRATIVO",1,null,null,"Puede ser el mismo Analista de Admisión y Estadísticas","Requerido"]
[null,null,null,null,null,null,"Trabajador Social","ASISTENCIAL",1,null,null,null,"Requerido"]
[null,null,null,null,null,null,"Jefe de Enfermería (Lcda. (o) en Enfermería con experiencia en servicios de diálisis y/o certificados avalizados por la Sociedad de Nefrología, Diálisis Y Trasplantes y/o Universidades acreditadas, notarizados)","ADMINISTRATIVO",1,null,null,"Puede ser el mismo que de prestación en el área de Diálisis Peritoneal","Requerido"]
[null,null,null,"GENERAL","SERVICIOS INTERNOS DE APOYO","Área de Apoyo y  almacenamiento (suministros e insumos) para el establecimiento","Auxiliar de Servicios","ADMINISTRATIVO",1,null,null,null,"Requerido"]
[null,null,null,null,null,"Limpieza","Auxiliar de Servicios ","ADMINISTRATIVO",1,null,null,null,"Requerido"]

{"sheet":"BaseNorma","index":2,"n_rows":247,"n_cols":8,"rows_kept":247,"cut":false,"hidden":false,"merged":[[242,0,246,0],[242,1,246,2],[177,0,191,0],[177,1,191,1],[177,2,191,2],[192,0,241,0],[192,1,241,1],[192,2,231,2],[232,2,241,2],[133,0,169,0],[133,1,169,1],[133,2,143,2],[144,2,169,2],[170,0,176,0],[170,1,176,1],[170,2,176,2],[0,0,0,7],[2,0,18,0],[2,1,18,1],[2,2,18,2],[19,0,132,0],[19,1,132,1],[19,2,55,2],[56,2,90,2],[91,2,112,2],[113,2,132,2]]}
[" CENTRO ESPECIALIZADO EN DIÁLISIS PERITONEAL"]
["GRUPO 00","GRUPO 01","GRUPO 02","Personal","Cant Mínima","Factor","Observaciones","TIPO"]
["ADMINISTRATIVO","ADMISIÓN Y ESTADISTICA","Admisión, Información y Recepción","Instructivo para el Llenado del Registro Diario Automatizado de Consultas y Atenciones Ambulatorias (RDACAA). 2013",1,null,"Será requerido para Establecimientos del MSP","Condición"]
[null,null,null,"Manual de Instalación del Tarjetero índice",1,null,"Será requerido para Establecimientos del MSP","Condición"]
[null,null,null,"Manual del Usuario del Tarjetero Indice",1,null,"Será requerido para Establecimientos del MSP","Condición"]
[null,null,null,"Manual de Manejo, Archivo de las Historias Clínicas",1,null,null,"Requerido"]
[null,null,null,"Norma Técnica: Subsistema de Referencia, Derivación, Contrareferencia, Referencia inversa y Transferencia del Sistema Nacional de Salud. 2014",1,null,null,"Requerido"]
[null,null,null,"Políticas Uso de Servicios de Red y Servicios Informáticos del Ministerio de Salud Pública",1,null,"Será requerido para Establecimientos del MSP","Condición"]
[null,null,null,"Modelo de Gestión de requerimientos e inconformidades ciudadanas para mejorar los servicios de salud a nivel nacional",1,null,null,"Requerido"]
[null,null,null,"Reglamento de Señalización de Seguridad para Establecimientos de Salud",1,null,null,"Requerido"]
[null,null,null,"Registro de Indicadores de Morbilidad y Mortalidad",1,null,null,"Requerido"]
[null,null,null,"Acuerdo Ministerial 5212: Tipología Sustitutiva para Homologar los Establecimientos de Salud por Niveles de Atención y Servicios de Apoyo del Sistema Nacional de Salud",1,null,null,"Requerido"]
[null,null,null,"Manual de Normas de Bioseguridad para la Red de Servicios de Salud en el Ecuador",1,null,null,"Requerido"]
[null,null,null,"Norma Técnica: Atención Integral en Violencia de Género. 2014",1,null,null,"Requerido"]
[null,null,null,"Protocolos de Procedimientos de Limpieza",1,null,null,"Requerido"]
[null,null,null,"Registro de limpieza del área funcional del Establecimiento",1,null,null,"Requerido"]
[null,null,null,"Registro de Mantenimiento de Equipos: Preventivo y/o Correctivo",1,null,null,"Requerido"]
[null,null,null,"Acuerdo Ministerial 5186: Reglamento Interministerial para la Gestión Integral de Desechos Sanitarios",1,null,null,"Requerido"]
[null,null,null,"Registro de Sistema de Información y Análisis Estadístico que Incluya: Consultas, Interconsultas, Procedimientos, Índice de Infecciones, Morbimortalidad, Manejo de Catéteres Peritoneales, Anemia, Hipertensión Arterial, Enfermedad Ósea, Nutrición, Atención Psicológica, Trabajo Social y Complicaciones de los pacientes en Diálisis Peritoneal.",1,null,null,"Requerido"]
["ASISTENCIAL","CONSULTA EXTERNA","Enfermería (En el caso de contar con la prestación, las condiciones se vuelven requeridas)","Instructivo para el Llenado del Registro Diario Automatizado de Consultas y Atenciones Ambulatorias (RDACAA). 2013",1,null,"Será requerido para Establecimientos del MSP","Condición"]
[null,null,null,"Clasificación Estadística Internacional de Enfermedades y Problemas Relacionados con la Salud. Décima Revisión - CIE10 ",1,null,null,"Condición"]
[null,null,null,"Reglamento a la Ley Organica de Salud",1,null,null,"Condición"]
[null,null,null,"Guía para la adecuación cultural de los servicios de salud. 2006",1,null,null,"Condición"]
[null,null,null,"Manual del modelo de atención integral en salud - MAIS. 2013",1,null,null,"Condición"]
[null,null,null,"Ley Derechos y Amparo al Paciente",1,null,null,"Condición"]
[null,null,null,"Cuadro nacional de medicamentos básicos y registro terapéutico. 9na revisión",1,null,null,"Condición"]
[null,null,null,"Acuerdo Ministerial 4693: Reforma a la 9na. Revisión del Cuadro Nacional de Medicamentos Básicos y Registro Terapéutico",1,null,null,"Condición"]
[null,null,null,"Modelo de gestión de aplicación de consentimiento informado en práctica asistencial. 2015",1,null,null,"Condición"]
[null,null,null,"Guía de Práctica Clínica: Cuidados Paliativos. 2014",1,null,null,"Condición"]
[null,null,null,"Norma de atención Cuidados Paliativos. 2015 ",1,null,null,"Condición"]
[null,null,null,"Guía de cuidados paliativos para el ciudadano",1,null,null,"Condición"]
[null,null,null,"Manual de procedimientos de Enfermería",1,null,null,"Condición"]
[null,null,null,"Guía de Práctica Clínica: Lupus eritematoso sistémico (LES). 2013 ",1,null,null,"Condición"]
[null,null,null,"Guía de Práctica Clínica: Transfusión de sangre y sus componentes. 2013 ",1,null,null,"Condición"]
[null,null,null,"Guía de Práctica Clínica: Prevención, Diagnóstico, Tratamiento y Control de la Tuberculosis. 2015",1,null,null,"Condición"]
[null,null,null,"Manual de Normas y Procedimientos para el Control de la Tuberculosis en Ecuador. 2010",1,null,null,"Condición"]
[null,null,null,"Guía de atención integral de adultos y Adolescentes con infección por VIH/SIDA. 2012",1,null,"Será requerido en el caso de ofertar la prestación","Condición"]
[null,null,null,"Normas y protocolos de atención integral de salud de las y los adultos mayores - 1. 2010",1,null,null,"Condición"]
[null,null,null,"Normas y protocolos de atención integral de salud de las y los adultos mayores - 2. 2010",1,null,null,"Condición"]
[null,null,null,"Normas y protocolos de atención integral de salud de las y los adultos mayores - 3. 2010",1,null,null,"Condición"]
[null,null,null,"Manual para cuidadores de la persona adulta mayor dependiente",1,null,null,"Condición"]
[null,null,null,"Normas de atención integral a la niñez. 2011 ",1,null,"Será requerido en el caso de ofertar la prestación","Condición"]
[null,null,null,"Normas y procedimientos para la atención integral de salud a adolescentes. 2009",1,null,"Será requerido en el caso de ofertar la prestación","Condición"]
[null,null,null,"Guía de Supervisión: Salud de Adolescentes. 2014",1,null,"Será requerido en el caso de ofertar la prestación","Condición"]
[null,null,null,"Promoción de la Salud Mental: Manejo del Estrés",1,null,null,"Condición"]
[null,null,null,"Guía de Abordaje del Tabaquismo en Atención Primaria de Salud",1,null,null,"Condición"]
[null,null,null,"Manual de procedimientos de antropometría y determinación de la presión arterial. 2012",1,null,null,"Condición"]
[null,null,null,"Acuerdo Ministerial 179: Promoción de Medicamentos en General",1,null,null,"Condición"]
[null,null,null,"Acuerdo Ministerial 1124: Instructivo para el uso de la Receta Médica. ",1,null,"Será requerido para Establecimientos del MSP","Condición"]
[null,null,null,"Acuerdo Ministerial 4912: Reforma al Reglamento para la Gestión del Suministro de Medicamentos y Control Administrativo Financiero, y el Instructivo  para el uso de la Receta Médica.",1,null,"Será requerido para Establecimientos del MSP","Condición"]
[null,null,null,"Acuerdo Ministerial 5186: Reglamento Interministerial para la Gestión Integral de Desechos Sanitarios",1,null,null,"Condición"]
[null,null,null,"Manual de lencería sanitaria para los establecimientos de salud pertenecientes al MSP. 2014",1,null,"Será requerido para Establecimientos del MSP","Condición"]
[null,null,null,"Manual de Normas de Bioseguridad para la Red de Servicios de Salud en el Ecuador",1,null,null,"Condición"]
[null,null,null,"Protocolos de Procedimientos de Limpieza, Desinfección y Esterilización",1,null,null,"Condición"]
[null,null,null,"Registro de limpieza y desinfección del área funcional del Establecimiento",1,null,null,"Condición"]
[null,null,null,"Registro de Mantenimiento de Equipos: Preventivo y/o Correctivo",1,null,null,"Condición"]
[null,null,"Consultorio Médico","Instructivo para el Llenado del Registro Diario Automatizado de Consultas y Atenciones Ambulatorias (RDACAA). 2013",1,null,"Será requerido para Establecimientos del MSP","Condición"]
[null,null,null,"Clasificación Estadística Internacional de Enfermedades y Problemas Relacionados con la Salud. Décima Revisión - CIE10 ",1,null,null,"Requerido"]
[null,null,null,"Reglamento a la Ley Organica de Salud",1,null,null,"Requerido"]
[null,null,null,"Guía para la adecuación cultural de los servicios de salud. 2006",1,null,null,"Requerido"]
[null,null,null,"Manual del modelo de atención integral en salud - MAIS. 2013",1,null,null,"Requerido"]
[null,null,null,"Ley Derechos y Amparo al Paciente",1,null,null,"Requerido"]
[null,null,null,"Ley de sustancias estupefacientes y Psicotrópicas",1,null,null,"Requerido"]
[null,null,null,"Cuadro nacional de medicamentos básicos y registro terapéutico. 9na revisión",1,null,null,"Requerido"]
[null,null,null,"Acuerdo Ministerial 4693: Reforma a la 9na. Revisión del Cuadro Nacional de Medicamentos Básicos y Registro Terapéutico",1,null,null,"Requerido"]
[null,null,null,"Norma Técnica: Subsistema de Referencia, Derivación, Contrareferencia, Referencia inversa y Transferencia del Sistema Nacional de Salud. 2014",1,null,null,"Requerido"]
[null,null,null,"Registro de Evolución de la Atención Médica y Procedimientos Efectuados",1,null,null,"Requerido"]
[null,null,null,"Registro de Indicadores para la Satisfacción del Usuario",1,null,null,"Requerido"]
[null,null,null,"Guía de Práctica Clínica: Cuidados Paliativos. 2014",1,null,null,"Requerido"]
[null,null,null,"Guía de Práctica Clínica: Lupus eritematoso sistémico (LES). 2013 ",1,null,null,"Requerido"]
[null,null,null,"Guía de Práctica Clínica: Transfusión de sangre y sus componentes. 2013 ",1,null,null,"Requerido"]
[null,null,null,"Guía de atención integral de adultos y Adolescentes con infección por VIH/SIDA. 2012",1,null,"Será requerido en el caso de ofertar la prestación","Condición"]
[null,null,null,"Guía de Práctica Clínica: Prevención, Diagnóstico, Tratamiento y Control de la Tuberculosis. 2015",1,null,null,"Requerido"]
[null,null,null,"Manual de Normas y Procedimientos para el Control de la Tuberculosis en Ecuador. 2010",1,null,null,"Requerido"]
[null,null,null,"Normas y protocolos para la alimentación y nutrición en la atención integral a personas que viven con VIH/SIDA. 2010",1,null,"Será requerido en el caso de ofertar la prestación","Condición"]
[null,null,null,"Norma de atención Cuidados Paliativos. 2015 ",1,null,null,"Requerido"]
[null,null,null,"Guía de cuidados paliativos para el ciudadano",1,null,null,"Requerido"]
[null,null,null,"Normas y protocolos de atención integral de salud de las y los adultos mayores - 1. 2010",1,null,null,"Requerido"]
[null,null,null,"Normas y protocolos de atención integral de salud de las y los adultos mayores - 2. 2010",1,null,null,"Requerido"]
[null,null,null,"Normas y protocolos de atención integral de salud de las y los adultos mayores - 3. 2010",1,null,null,"Requerido"]
[null,null,null,"Normas y procedimientos para la atención integral de salud a adolescentes. 2009",1,null,"Será requerido en el caso de ofertar la prestación","Condición"]
[null,null,null,"Guía de Supervisión: Salud de Adolescentes. 2014",1,null,"Será requerido en el caso de ofertar la prestación","Condición"]
[null,null,null,"Manual de procedimientos de antropometría y determinación de la presión arterial. 2012",1,null,null,"Requerido"]
[null,null,null,"Acuerdo Ministerial 179: Promoción de Medicamentos en General",1,null,null,"Requerido"]
[null,null,null,"Acuerdo Ministerial 1124: Instructivo para el uso de la Receta Médica. ",1,null,"Será requerido para Establecimientos del MSP","Condición"]
[null,null,null,"Acuerdo Ministerial 4912: Reforma al Reglamento para la Gestión del Suministro de Medicamentos y Control Administrativo Financiero, y el Instructivo  para el uso de la Receta Médica.",1,null,"Será requerido para Establecimientos del MSP","Condición"]
[null,null,null,"Acuerdo Ministerial 5186: Reglamento Interministerial para la Gestión Integral de Desechos Sanitarios",1,null,null,"Requerido"]
[null,null,null,"Manual de Normas de Bioseguridad para la Red de Servicios de Salud en el Ecuador",1,null,null,"Requerido"]
[null,null,null,"Protocolos de Procedimientos de Limpieza, Desinfección y Esterilización",1,null,null,"Requerido"]
[null,null,null,"Registro de limpieza y desinfección del área funcional del Establecimiento",1,null,null,"Requerido"]
[null,null,null,"Registro de Mantenimiento de Equipos: Preventivo y/o Correctivo",1,null,null,"Requerido"]
[null,null,"Consultorio de Psicología","Instructivo para el Llenado del Registro Diario Automatizado de Consultas y Atenciones Ambulatorias (RDACAA). 2013",1,null,"Será requerido para Establecimientos del MSP","Condición"]
[null,null,null,"Clasificación Estadística Internacional de Enfermedades y Problemas Relacionados con la Salud. Décima Revisión - CIE10 ",1,null,null,"Requerido"]
[null,null,null,"Reglamento a la Ley Organica de Salud",1,null,null,"Requerido"]
[null,null,null,"Guía para la adecuación cultural de los servicios de salud. 2006",1,null,null,"Requerido"]
[null,null,null,"Manual del modelo de atención integral en salud - MAIS. 2013",1,null,null,"Requerido"]
[null,null,null,"Ley Derechos y Amparo al Paciente",1,null,null,"Requerido"]
[null,null,null,"Ley de sustancias estupefacientes y Psicotrópicas",1,null,null,"Requerido"]
[null,null,null,"Cuadro nacional de medicamentos básicos y registro terapéutico. 9na revisión",1,null,null,"Requerido"]
[null,null,null,"Acuerdo Ministerial 4693: Reforma a la 9na. Revisión del Cuadro Nacional de Medicamentos Básicos y Registro Terapéutico",1,null,null,"Requerido"]
[null,null,null,"Norma Técnica: Subsistema de Referencia, Derivación, Contrareferencia, Referencia inversa y Transferencia del Sistema Nacional de Salud. 2014",1,null,null,"Requerido"]
[null,null,null,"Fundamentos de la Prevención en Materia de Drogas",1,null,"Será requerido para Establecimientos del MSP","Condición"]
[null,null,null,"Guía de Abordaje del Tabaquismo en Atención Primaria de Salud",1,null,"Será requerido para Establecimientos del MSP","Condición"]
[null,null,null,"Guía de Práctica Clínica: Lupus eritematoso sistémico (LES). 2013 ",1,null,null,"Requerido"]
[null,null,null,"Plan Estratégico Nacional de Salud Mental 2015 - 2017",1,null,null,"Requerido"]
[null,null,null,"Modelo de Atención de Salud Mental, en el Marco del Modelo de Atención Integral de Salud (MAIS) - con enfoque familiar, comunitario e intercultural",1,null,null,"Requerido"]
[null,null,null,"Acuerdo Ministerial 1124: Instructivo para el uso de la Receta Médica. ",1,null,"Será requerido para Establecimientos del MSP","Condición"]
[null,null,null,"Acuerdo Ministerial 4912: Reforma al Reglamento para la Gestión del Suministro de Medicamentos y Control Administrativo Financiero, y el Instructivo  para el uso de la Receta Médica.",1,null,"Será requerido para Establecimientos del MSP","Condición"]
[null,null,null,"Acuerdo Ministerial 5186: Reglamento Interministerial para la Gestión Integral de Desechos Sanitarios",1,null,null,"Requerido"]
[null,null,null,"Manual de Normas de Bioseguridad para la Red de Servicios de Salud en el Ecuador",1,null,null,"Requerido"]
[null,null,null,"Protocolos de Procedimientos de Limpieza, Desinfección y Esterilización",1,null,null,"Requerido"]
[null,null,null,"Registro de limpieza y desinfección del área funcional del Establecimiento",1,null,null,"Requerido"]
[null,null,null,"Registro de Mantenimiento de Equipos: Preventivo y/o Correctivo",1,null,null,"Requerido"]
[null,null,"Consultorio de Nutrición","Instructivo para el Llenado del Registro Diario Automatizado de Consultas y Atenciones Ambulatorias (RDACAA). 2013",1,null,"Será requerido para Establecimientos del MSP","Condición"]
[null,null,null,"Clasificación Estadística Internacional de Enfermedades y Problemas Relacionados con la Salud. Décima Revisión - CIE10 ",1,null,null,"Requerido"]
[null,null,null,"Reglamento a la Ley Organica de Salud",1,null,null,"Requerido"]
[null,null,null,"Guía para la adecuación cultural de los servicios de salud. 2006",1,null,null,"Requerido"]
[null,null,null,"Manual del modelo de atención integral en salud - MAIS. 2013",1,null,null,"Requerido"]
[null,null,null,"Ley Derechos y Amparo al Paciente",1,null,null,"Requerido"]
[null,null,null,"Cuadro nacional de medicamentos básicos y registro terapéutico. 9na revisión",1,null,null,"Requerido"]
[null,null,null,"Acuerdo Ministerial 4693: Reforma a la 9na. Revisión del Cuadro Nacional de Medicamentos Básicos y Registro Terapéutico",1,null,null,"Requerido"]
[null,null,null,"Norma Técnica: Subsistema de Referencia, Derivación, Contrareferencia, Referencia inversa y Transferencia del Sistema Nacional de Salud. 2014",1,null,null,"Requerido"]
[null,null,null,"Normas y protocolos para la alimentación y nutrición en la atención integral a personas que viven con VIH/SIDA. 2010",1,null,"Será requerido en el caso de ofertar la prestación","Condición"]
[null,null,null,"Introducción a la Guía de actividad Física dirigido al personal de salud I. 2011",1,null,null,"Requerido"]
[null,null,null,"Guía de actividad Física dirigido al personal de salud II. 2011",1,null,null,"Requerido"]
[null,null,null,"Manual de procedimientos de antropometría y determinación de la presión arterial. 2012",1,null,null,"Requerido"]
[null,null,null,"Acuerdo Ministerial 1124: Instructivo para el uso de la Receta Médica. ",1,null,"Será requerido para Establecimientos del MSP","Condición"]
[null,null,null,"Acuerdo Ministerial 4912: Reforma al Reglamento para la Gestión del Suministro de Medicamentos y Control Administrativo Financiero, y el Instructivo  para el uso de la Receta Médica.",1,null,"Será requerido para Establecimientos del MSP","Condición"]
[null,null,null,"Acuerdo Ministerial 5186: Reglamento Interministerial para la Gestión Integral de Desechos Sanitarios",1,null,null,"Requerido"]
[null,null,null,"Manual de Normas de Bioseguridad para la Red de Servicios de Salud en el Ecuador",1,null,null,"Requerido"]
[null,null,null,"Protocolos de Procedimientos de Limpieza, Desinfección y Esterilización",1,null,null,"Requerido"]
[null,null,null,"Registro de limpieza y desinfección del área funcional del Establecimiento",1,null,null,"Requerido"]
[null,null,null,"Registro de Mantenimiento de Equipos: Preventivo y/o Correctivo",1,null,null,"Requerido"]
["APOYO TERAPÉUTICO","ATENCIÓN DE APOYO TERAPÉUTICO","Área de Procedimientos","Instructivo para el Llenado del Registro Diario Automatizado de Consultas y Atenciones Ambulatorias (RDACAA). 2013",1,null,"Será requerido para Establecimientos del MSP","Condición"]
[null,null,null,"Norma Técnica: Subsistema de Referencia, Derivación, Contrareferencia, Referencia inversa y Transferencia del Sistema Nacional de Salud. 2014",1,null,null,"Condición"]
[null,null,null,"Modelo de gestión de aplicación de consentimiento informado en práctica asistencial. 2015",1,null,null,"Condición"]
[null,null,null,"Lista de Verificación de la Seguridad de la Cirugía",1,null,"Será requerido en el caso de ofertar la prestación","Condición"]
[null,null,null,"Manual de Aplicación de la lista OMS de verificación de la seguridad de la cirugía. 2009",1,null,"Será requerido en el caso de ofertar la prestación","Condición"]
[null,null,null,"La Cirugía Segura Salva Vidas. 2013",1,null,"Será requerido en el caso de ofertar la prestación","Condición"]
[null,null,null,"Acuerdo Ministerial 5186: Reglamento Interministerial para la Gestión Integral de Desechos Sanitarios",1,null,null,"Condición"]
[null,null,null,"Manual de Normas de Bioseguridad para la Red de Servicios de Salud en el Ecuador",1,null,null,"Condición"]
[null,null,null,"Protocolos de Procedimientos de Limpieza, Desinfección y Esterilización",1,null,null,"Condición"]
[null,null,null,"Registro de limpieza y desinfección del área funcional del Establecimiento",1,null,null,"Condición"]
[null,null,null,"Registro de Mantenimiento de Equipos: Preventivo y/o Correctivo",1,null,null,"Condición"]
[null,null,"Área de Diálisis Peritoneal","Instructivo para el Llenado del Registro Diario Automatizado de Consultas y Atenciones Ambulatorias (RDACAA). 2013",1,null,"Será requerido para Establecimientos del MSP","Condición"]
[null,null,null,"Clasificación Estadística Internacional de Enfermedades y Problemas Relacionados con la Salud. Décima Revisión - CIE10 ",1,null,null,"Requerido"]
[null,null,null,"Reglamento a la Ley Organica de Salud",1,null,null,"Requerido"]
[null,null,null,"Guía para la adecuación cultural de los servicios de salud. 2006",1,null,null,"Requerido"]
[null,null,null,"Manual del modelo de atención integral en salud - MAIS. 2013",1,null,null,"Requerido"]
[null,null,null,"Ley Derechos y Amparo al Paciente",1,null,null,"Requerido"]
[null,null,null,"Ley de sustancias estupefacientes y Psicotrópicas",1,null,null,"Requerido"]
[null,null,null,"Cuadro nacional de medicamentos básicos y registro terapéutico. 9na revisión",1,null,null,"Requerido"]
[null,null,null,"Acuerdo Ministerial 4693: Reforma a la 9na. Revisión del Cuadro Nacional de Medicamentos Básicos y Registro Terapéutico",1,null,null,"Requerido"]
[null,null,null,"Norma Técnica: Subsistema de Referencia, Derivación, Contrareferencia, Referencia inversa y Transferencia del Sistema Nacional de Salud. 2014",1,null,null,"Requerido"]
[null,null,null,"Protocolo de procedimientos de Diálisis Peritoneal",1,null,null,"Requerido"]
[null,null,null,"Registro de Evolución de la Atención Médica y Procedimientos Efectuados",1,null,null,"Requerido"]
[null,null,null,"Registro de Indicadores para la Satisfacción del Usuario",1,null,null,"Requerido"]
[null,null,null,"Guía de Práctica Clínica: Transfusión de sangre y sus componentes. 2013 ",1,null,null,"Requerido"]
[null,null,null,"Guía de atención integral de adultos y Adolescentes con infección por VIH/SIDA. 2012",1,null,"Será requerido en el caso de ofertar la prestación","Condición"]
[null,null,null,"Normas y protocolos de atención integral de salud de las y los adultos mayores - 1. 2010",1,null,null,"Requerido"]
[null,null,null,"Normas y protocolos de atención integral de salud de las y los adultos mayores - 2. 2010",1,null,null,"Requerido"]
[null,null,null,"Normas y protocolos de atención integral de salud de las y los adultos mayores - 3. 2010",1,null,null,"Requerido"]
[null,null,null,"Normas y procedimientos para la atención integral de salud a adolescentes. 2009",1,null,"Será requerido en el caso de ofertar la prestación","Condición"]
[null,null,null,"Guía de Supervisión: Salud de Adolescentes. 2014",1,null,"Será requerido en el caso de ofertar la prestación","Condición"]
[null,null,null,"Manual de procedimientos de antropometría y determinación de la presión arterial. 2012",1,null,null,"Requerido"]
[null,null,null,"Acuerdo Ministerial 5186: Reglamento Interministerial para la Gestión Integral de Desechos Sanitarios",1,null,null,"Requerido"]
[null,null,null,"Manual de Normas de Bioseguridad para la Red de Servicios de Salud en el Ecuador",1,null,null,"Requerido"]
[null,null,null,"Protocolos de Procedimientos de Limpieza, Desinfección y Esterilización",1,null,null,"Requerido"]
[null,null,null,"Registro de limpieza y desinfección del área funcional del Establecimiento",1,null,null,"Requerido"]
[null,null,null,"Registro de Mantenimiento de Equipos: Preventivo y/o Correctivo",1,null,null,"Requerido"]
["APOYO DIAGNÓSTICO ","DIAGNÓSTICO EN LABORATORIO (LABORATORIO DE ANÁLISIS CLÍNICO)","Área de Análisis","Acuerdo Ministerial 2393: Reglamento para el Funcionamiento de los Laboratorios Clinicos",1,null,null,"Condición"]
[null,null,null,"Acuerdo Ministerial 5186: Reglamento Interministerial para la Gestión Integral de Desechos Sanitarios",1,null,null,"Condición"]
[null,null,null,"Manual de Normas de Bioseguridad para la Red de Servicios de Salud en el Ecuador",1,null,null,"Condición"]
[null,null,null,"Protocolos de Procedimientos de Limpieza, Desinfección y Esterilización",1,null,null,"Condición"]
[null,null,null,"Registro de limpieza y desinfección del área funcional del Establecimiento",1,null,null,"Condición"]
[null,null,null,"Registro de Mantenimiento de Equipos: Preventivo y/o Correctivo",1,null,null,"Condición"]
[null,null,null,"Registro de Temperatura de los Refrigeradores",1,null,null,"Condición"]
["APOYO TERAPÉUTICO","DOTACIÓN DE MEDICAMENTOS Y DISPOSITIVOS MÉDICOS (FARMACIA)","Área de Farnacia","Guía para la recepción y almacenamiento de medicamentos en el MSP",1,null,"Será requerido para Establecimientos del MSP","Condición"]
[null,null,null,"Manual de Procesos para la Gestión de Suministros de Medicamentos",1,null,"Será requerido para Establecimientos del MSP","Condición"]
[null,null,null,"Acuerdo Ministerial 1124: Instructivo para el uso de la Receta Médica. ",1,null,"Será requerido para Establecimientos del MSP","Condición"]
[null,null,null,"Acuerdo Ministerial 4912: Reforma al Reglamento para la Gestión del Suministro de Medicamentos y Control Administrativo Financiero, y el Instructivo  para el uso de la Receta Médica.",1,null,"Será requerido para Establecimientos del MSP","Condición"]
[null,null,null,"Cuadro nacional de medicamentos básicos y registro terapéutico. 9na revisión",1,null,null,"Requerido"]
[null,null,null,"Acuerdo Ministerial 4693: Reforma a la 9na. Revisión del Cuadro Nacional de Medicamentos Básicos y Registro Terapéutico",1,null,null,"Requerido"]
[null,null,null,"Acuerdo Ministerial 205: Reglamento para el registro y control sanitario de dispositivos médicos, reactivos bioquímicos y de diagnóstico; y, productos dentales",1,null,null,"Requerido"]
[null,null,null,"Acuerdo Ministerial 4872: Reglamento de buenas prácticas de almacenamiento, distribución y transporte para establecimientos farmacéuticos",1,null,null,"Requerido"]
[null,null,null,"Registro de Temperatura de los refrigeradores ",1,null,null,"Requerido"]
[null,null,null,"Registro de Temperatura y Humedad ambiental",1,null,null,"Requerido"]
[null,null,null,"Acuerdo Ministerial 5186: Reglamento Interministerial para la Gestión Integral de Desechos Sanitarios",1,null,null,"Requerido"]
[null,null,null,"Manual de Normas de Bioseguridad para la Red de Servicios de Salud en el Ecuador",1,null,null,"Requerido"]
[null,null,null,"Protocolos de Procedimientos de Limpieza, Desinfección y Esterilización",1,null,null,"Requerido"]
[null,null,null,"Registro de limpieza y desinfección del área funcional del Establecimiento",1,null,null,"Requerido"]
[null,null,null,"Registro de Mantenimiento de Equipos: Preventivo y/o Correctivo",1,null,null,"Requerido"]
["ADMINISTRATIVO","ADMINISTRACIÓN TÉCNICA","Despacho del Director ","Constitución de la Republica del Ecuador",1,null,null,"Requerido"]
[null,null,null,"Plan Nacional del Buen Vivir 2013-2017",1,null,null,"Requerido"]
[null,null,null,"Agenda Social 2017",1,null,null,"Requerido"]
[null,null,null,"Código Orgánico Integral Penal - COIP",1,null,null,"Requerido"]
[null,null,null,"Ley Orgánica del Servidor Publico - LOSEP",1,null,"Será requerido para Establecimientos del MSP","Condición"]
[null,null,null,"Reglamento a Ley Orgánica del Servidor Publico - LOSEP",1,null,"Será requerido para Establecimientos del MSP","Condición"]
[null,null,null,"Codificación del Código del Trabajo (2005)",1,null,null,"Requerido"]
[null,null,null,"Código Orgánico de Organización Territorial, Autonomia y Descentralización - COOTAD",1,null,null,"Requerido"]
[null,null,null,"Instructivo para el Llenado del Registro Diario Automatizado de Consultas y Atenciones Ambulatorias (RDACAA). 2013",1,null,"Será requerido para Establecimientos del MSP","Condición"]
[null,null,null,"Estatuto orgánico de gestión organizacional por procesos del Ministerio de Salud Pública",1,null,"Será requerido para Establecimientos del MSP","Condición"]
[null,null,null,"Estatuto orgánico de gestión organizacional por procesos de los hospitales del Ministerio de Salud Pública",1,null,"Será requerido para Establecimientos del MSP","Condición"]
[null,null,null,"Distribución Zonas Distritos 2011",1,null,null,"Requerido"]
[null,null,null,"Manual del Sistema Organizado de la Red de Servicios de Salud",1,null,null,"Requerido"]
[null,null,null,"Guía para la adecuación cultural de los servicios de salud. 2006",1,null,null,"Requerido"]
[null,null,null,"Norma Técnica: Subsistema de Referencia, Derivación, Contrareferencia, Referencia inversa y Transferencia del Sistema Nacional de Salud. 2014",1,null,null,"Requerido"]
[null,null,null,"Políticas Uso de Servicios de Red y Servicios Informáticos del Ministerio de Salud Pública",1,null,"Será requerido para Establecimientos del MSP","Condición"]
[null,null,null,"Modelo de Gestión de requerimientos e inconformidades ciudadanas para mejorar los servicios de salud a nivel nacional",1,null,null,"Requerido"]
[null,null,null,"Reglamento de Señalización de Seguridad para Establecimientos de Salud",1,null,null,"Requerido"]
[null,null,null,"Registro de Atenciones de Morbilidad y Mortalidad",1,null,null,"Requerido"]
[null,null,null,"Acuerdo Ministerial 179: Promoción de Medicamentos en General",1,null,null,"Requerido"]
[null,null,null,"Acuerdo Ministerial 5212: Tipología Sustitutiva para Homologar los Establecimientos de Salud por Niveles de Atención y Servicios de Apoyo del Sistema Nacional de Salud",1,null,null,"Requerido"]
[null,null,null,"Registro de Interconsultas de especialidad según criterio del médico nefrólogo tratante (hasta 2 por un año): neumología, cardiología, gastroenterología, neurología y endocrinología",1,null,null,"Requerido"]
[null,null,null,"Registro de Indicadores de Morbilidad y Mortalidad",1,null,null,"Requerido"]
[null,null,null,"Registro de Mantenimiento de Equipos: Preventivo o Correctivo ",1,null,null,"Requerido"]
[null,null,null,"Registro Consolidado de mantenimiento de equipos: preventio y/o correctivo",1,null,null,"Requerido"]
[null,null,null,"Protocolo de procedimientos de Diálisis Peritoneal",1,null,null,"Condición"]
[null,null,null,"Protocolo de procedimientos de enfermería",1,null,null,"Requerido"]
[null,null,null,"Plan de Gestión Integral de Desechos Sanitarios",1,null,null,"Requerido"]
[null,null,null,"Protocolos de Limpieza, Desinfección y Esterilización",1,null,null,"Requerido"]
[null,null,null,"Registro Consolidado de limpieza de las áreas funcionales del Establecimiento",1,null,null,"Requerido"]
[null,null,null,"Programa anual de capacitación continua para el personal del Establecimiento",1,null,null,"Requerido"]
[null,null,null,"Registros de asistencias del personal del Establecimiento a capacitaciones",1,null,null,"Requerido"]
[null,null,null,"Reglamento Interno",1,null,null,"Requerido"]
[null,null,null,"Manual de Normas de Bioseguridad para la Red de Servicios de Salud en el Ecuador.",1,null,null,"Requerido"]
[null,null,null,"Plan de Gestión Integral de Desechos Sanitarios",1,null,null,"Requerido"]
[null,null,null,"Acuerdo Ministerial 5186: Reglamento Interministerial para la Gestión Integral de Desechos Sanitarios",1,null,null,"Requerido"]
[null,null,null,"Norma técnica para la derivación y financiamiento de cobertura internacional para la atención integral de salud de usuarios con enfermedades catasrófica. 2013",1,null,null,"Requerido"]
[null,null,null,"Política nacional de hospitales seguros. 2008",1,null,null,"Requerido"]
[null,null,null,"Acuerdo Ministerial 1829: Emitir los criterios de inclusión de enfermedades consideredas catastróficas, raras y huérfanas para beneficiarios del bono Joaquín Gallegos Lara",1,null,"Será requerido para Establecimientos del MSP","Condición"]
[null,null,null,"Reforma a la ley orgánica de salud para incluir el tratamiento de las enfermedades raras, huérfanas y catastróficas. Año 2012. Oficio San-2012-00 ",1,null,"Será requerido para Establecimientos del MSP","Condición"]
[null,null,"Oficina de Trabajo Social","Reglamento a la Ley Organica de Salud",1,null,null,"Requerido"]
[null,null,null,"Guía para la adecuación cultural de los servicios de salud. 2006",1,null,null,"Requerido"]
[null,null,null,"Manual del modelo de atención integral en salud - MAIS. 2013",1,null,null,"Requerido"]
[null,null,null,"Ley Derechos y Amparo al Paciente",1,null,null,"Requerido"]
[null,null,null,"Cuadro nacional de medicamentos básicos y registro terapéutico. 9na revisión",1,null,null,"Requerido"]
[null,null,null,"Acuerdo Ministerial 5186: Reglamento Interministerial para la Gestión Integral de Desechos Sanitarios",1,null,null,"Requerido"]
[null,null,null,"Manual de Normas de Bioseguridad para la Red de Servicios de Salud en el Ecuador",1,null,null,"Requerido"]
[null,null,null,"Protocolos de Procedimientos de Limpieza, Desinfección y Esterilización",1,null,null,"Requerido"]
[null,null,null,"Registro de limpieza y desinfección del área funcional del Establecimiento",1,null,null,"Requerido"]
[null,null,null,"Registro de Mantenimiento de Equipos: Preventivo y/o Correctivo",1,null,null,"Requerido"]
["GENERAL","SERVICIOS INTERNOS DE APOYO",null,"Acuerdo Ministerial 5186: Reglamento Interministerial para la Gestión Integral de Desechos Sanitarios",1,null,null,"Requerido"]
[null,null,null,"Manual de Normas de Bioseguridad para la Red de Servicios de Salud en el Ecuador",1,null,null,"Requerido"]
[null,null,null,"Protocolos de Procedimientos de Limpieza, Desinfección y Esterilización",1,null,null,"Requerido"]
[null,null,null,"Registro de limpieza y desinfección del área funcional del Establecimiento",1,null,null,"Requerido"]
[null,null,null,"Registro de Mantenimiento de Equipos: Preventivo y/o Correctivo",1,null,null,"Requerido"]

{"sheet":"Menu","index":3,"n_rows":18,"n_cols":18,"rows_kept":18,"cut":false,"hidden":false,"merged":[[10,4,10,9],[11,4,11,9],[12,4,12,9],[13,4,13,9],[1,1,1,9],[2,1,2,9],[4,1,4,3],[4,4,4,9],[5,1,5,3],[5,4,5,9],[10,1,10,3],[11,1,11,3],[12,1,12,3],[6,1,6,3],[8,1,8,3],[9,1,9,3],[6,4,6,9],[14,4,14,9],[14,1,14,3],[16,4,16,9],[17,4,17,9],[15,1,15,3],[15,4,15,9],[16,1,16,3]]}
[]
[null,"MATRIZ DE LICENCIAMIENTO:"]
[null,"CENTRO ESPECIALIZADO EN DIÁLISIS PERITONEAL"]
[]
[null,"ENTIDAD DEL SISTEMA:"]
[null,"NOMBRE UNIDAD OPERATIVA:"]
[null,"CÓDIGO/RUC:"]
[null,null,null,"REGION:"]
[null,"PROVINCIA:"]
[null,"CANTON:"]
[null,"PARROQUIA:"]
[null,"ZONA:",null,null,null,null,null,null,null,null,null,null,null,null,null,null,null," "]
[null,"DIRECCION:"]
[null,null,null,"TELÉFONO:"]
[null,"AREA/DISTRITO:"]
[null,"RESPONSABLE:",null,null," "]
[null,"CORREO ELECTRÓNICO:"]
[null,null,null,"FECHA:"]

{"sheet":"Infraestructura","index":4,"n_rows":289,"n_cols":46,"rows_kept":289,"cut":false,"hidden":false,"merged":[[2,22,2,29],[2,30,2,37],[2,38,2,45],[66,0,66,8],[3,0,3,8],[4,0,4,8],[5,0,5,8],[13,0,13,8],[23,0,23,8],[24,0,24,8],[49,0,49,8],[50,0,50,8],[57,0,57,8],[64,0,64,8],[65,0,65,8],[67,0,67,8],[1,0,1,8],[2,0,2,8],[2,14,2,21],[41,0,41,8],[48,0,48,8],[25,0,25,8],[32,0,32,8],[33,0,33,8],[109,0,109,8],[110,0,110,8],[117,0,117,8],[118,0,118,8],[124,0,124,8],[131,0,131,8],[76,0,76,8],[82,0,82,8],[83,0,83,8],[84,0,84,8],[93,0,93,8],[101,0,101,8],[184,0,184,8],[185,0,185,8],[163,0,163,8],[164,0,164,8],[171,0,171,8],[177,0,177,8],[178,0,178,8],[132,0,132,8],[133,0,133,8],[142,0,142,8],[148,0,148,8],[154,0,154,8],[162,0,162,8],[233,22,233,29],[234,22,234,29],[235,22,235,29],[236,22,236,29],[237,22,237,29],[238,22,238,29],[193,0,193,8],[194,0,194,8],[200,0,200,8],[201,0,201,8],[209,0,209,8],[232,22,232,29],[245,22,245,29],[246,22,246,29],[247,22,247,29],[248,22,248,29],[249,22,249,29],[250,22,250,29],[239,22,239,29],[240,22,240,29],[241,22,241,29],[242,22,242,29],[243,22,243,29],[244,22,244,29],[257,22,257,29],[258,22,258,29],[259,22,259,29],[260,22,260,29],[261,22,261,29],[262,22,262,29],[251,22,251,29],[252,22,252,29],[253,22,253,29],[254,22,254,29],[255,22,255,29],[256,22,256,29],[271,22,271,29],[272,22,272,29],[273,22,273,29],[274,22,274,29],[263,22,263,29],[264,22,264,29],[265,22,265,29],[266,22,266,29],[267,22,267,29],[268,22,268,29],[287,22,287,29],[288,22,288,29],[289,22,289,29],[290,22,290,29],[231,0,231,8],[232,0,232,1],[233,0,233,1],[234,0,234,1],[235,0,235,1],[236,0,236,1],[281,22,281,29],[282,22,282,29],[283,22,283,29],[284,22,284,29],[285,22,285,29],[286,22,286,29],[275,22,275,29],[276,22,276,29],[277,22,277,29],[278,22,278,29],[279,22,279,29],[280,22,280,29],[269,22,269,29],[270,22,270,29],[243,0,243,1],[244,0,244,1],[245,0,245,1],[237,0,237,1],[238,0,238,1],[239,0,239,1],[240,0,240,1],[241,0,241,1],[242,0,242,1],[251,0,251,1],[252,0,252,1],[253,0,253,1],[254,0,254,1],[255,0,255,1],[256,0,256,1],[246,0,246,1],[247,0,247,1],[248,0,248,1],[249,0,249,1],[250,0,250,1],[263,0,263,1],[264,0,264,1],[274,0,274,4],[275,0,275,4],[276,0,276,4],[277,0,277,4],[257,0,257,1],[258,0,258,1],[259,0,259,1],[260,0,260,1],[261,0,261,1],[262,0,262,1],[273,0,273,1],[265,0,265,1],[266,0,266,1],[267,0,267,1],[268,0,268,1],[269,0,269,1],[270,0,270,1],[271,0,271,1],[272,0,272,1],[288,0,288,4],[282,0,282,4],[283,0,283,4],[285,0,285,4],[286,0,286,4],[287,0,287,4],[278,0,278,1],[279,0,279,1],[280,0,280,4],[281,0,281,4]]}
["FILTROS:","Anx:","Requerido:","m² Util:","Tipo:","BUENO:","MALO:","Calif:","Observaciones:"]
[{"$f":"Menu!$B$3","v":"CENTRO ESPECIALIZADO EN DIÁLISIS PERITONEAL"}]
["INFRAESTRUCTURA",null,null,null,null,null,null,null,null,null,null,null,null,null,"AMBIENTES",null,null,null,null,null,null,null,"INSTALACIONES",null,null,null,null,null,null,null,"TOTAL AMBIENTES",null,null,null,null,null,null,null,"TOTAL INSTALACIONES"]
["SERVICIO DE ADMISIÓN Y CONSULTA EXTERNA",null,null,null,null,null,null,null,null,null,null,null,null,null,null,null,null,null,null,null,null,null,null,null,null,null,null,null,null,null,{"$f":"SUM(O5:O23)","v":70},{"$f":"SUM(P5:P23)","v":0},{"$f":"SUM(Q5:Q23)","v":0},{"$f":"SUM(R5:R23)","v":0},0,0,10,0,0,0,0,0,0,0,0,0]
["CONSULTA EXTERNA",null,null,null,null,null,null,null,null,null,null,null,null,null,null,null,null,null,null,null,null,null,null,null,null,null,null,null,null,null,{"$f":"SUM(O6:O23)","v":70},{"$f":"SUM(P6:P23)","v":0},{"$f":"SUM(Q6:Q23)","v":0},0,0,0,10,0,0,0,0,0,0,0,0,0]
["ADMISIÓN Y CONTROL",null,null,null,null,null,null,null,null,null,null,null,null,null,null,null,null,null,null,null,null,null,null,null,null,null,null,null,null,null,{"$f":"SUM(O7:O13)","v":30},{"$f":"SUM(P7:P13)","v":0},{"$f":"SUM(Q7:Q13)","v":0},{"$f":"SUM(R7:R13)","v":0},0,0,0,0,0,0,0,0,0,0,0,0]
["AMBIENTES",{"$f":"B1","v":"Anx:"},{"$f":"C$1","v":"Requerido:"},"m² Util:","Tipo:","BUENO:","MALO:","Calif:","Observaciones:",null,"AMBIENTE",null,null,null,null,null,null,null,null,null,null,null,null,null,null,null,null,null,null,null,{"$f":"SUM(O8:O10)","v":30},{"$f":"SUM(P8:P10)","v":0},{"$f":"SUM(Q8:Q10)","v":0},{"$f":"SUM(R8:R10)","v":0},0,0,0,0,0,0,0,0,0,0,0,0]
["Baterías Sanitarias",null,2,"-","Requerido",0,0,{"$f":"IF(AND(F8>=C8,F8>0),10,0)","v":0},null,null,"AMBIENTE",null,null,null,{"$f":"IF(UPPER(E8)=\"REQUERIDO\", 10, \"\")","v":10},{"$f":"IF(UPPER(E8)=\"REQUERIDO\", H8, \"\")","v":0}]
["Recepción Admisión",null,1,"-","Requerido",0,0,{"$f":"IF(AND(F9>=C9,F9>0),10,0)","v":0},null,null,"AMBIENTE",null,null,null,{"$f":"IF(UPPER(E9)=\"REQUERIDO\", 10, \"\")","v":10},{"$f":"IF(UPPER(E9)=\"REQUERIDO\", H9, \"\")","v":0}]
["Sala de Espera",null,1,"12m²","Requerido",0,0,{"$f":"IF(AND(F10>=C10,F10>0),10,0)","v":0},null,null,null,null,null,null,{"$f":"IF(UPPER(E10)=\"REQUERIDO\", 10, \"\")","v":10},{"$f":"IF(UPPER(E10)=\"REQUERIDO\", H10, \"\")","v":0}]
["INSTALACIONES",{"$f":"B1","v":"Anx:"},{"$f":"C$1","v":"Requerido:"},"m² Util:","Tipo:","BUENO:","MALO:","Calif:","Observaciones:",null,"INSTALACIÓN",null,null,null,null,null,null,null,null,null,null,null,null,null,null,null,null,null,null,null,{"$f":"SUM(O12:O13)","v":0},{"$f":"SUM(P12:P13)","v":0},0,0,0,0,0,0,0,0,0,0,0,0,0,0]
["Estructura General ","DIA_EG_01",1,".","Requerido",0,0,{"$f":"IF(AND(F12>=C12,F12>0),10,0)","v":0},null,null,"INSTALACIÓN"]
["Instalaciones Generales","DIA_IG_01",1,"-","Requerido",0,0,{"$f":"IF(AND(F13>=C13,F13>0),10,0)","v":0}]
["ÁREA DE PACIENTE",null,null,null,null,null,null,null,null,null,null,null,null,null,null,null,null,null,null,null,null,null,null,null,null,null,null,null,null,null,{"$f":"SUM(O15:O20)","v":40},{"$f":"SUM(P15:P20)","v":0},{"$f":"SUM(Q15:Q20)","v":0},{"$f":"SUM(R15:R20)","v":0},0,0,10,0,0,0,0,0,0,0,0,0]
["AMBIENTES",{"$f":"B1","v":"Anx:"},{"$f":"C$1","v":"Requerido:"},"m² Util:","Tipo:","BUENO:","MALO:","Calif:","Observaciones:",null,null,null,null,null,null,null,null,null,null,null,null,null,null,null,null,null,null,null,null,null,{"$f":"SUM(O16:O20)","v":40},{"$f":"SUM(P16:P20)","v":0},{"$f":"SUM(Q16:Q20)","v":0},{"$f":"SUM(R16:R20)","v":0},0,0,10,0,0,0,0,0,0,0,0,0]
["Consultorio de Enfermería con Lavabo. (Se convertirá en REQUERIDO cuando exista 5 Consultorios Médicos)",null,1,"-","Condición",0,0,{"$f":"IF(AND(F16>=C16,F16>0),10,0)","v":0},null,null,"AMBIENTE",null,null,null,null,null,null,null,null,null,{"$f":"IF(UPPER(E16)=\"CONDICIÓN\", 10, 0)","v":10},{"$f":"IF(UPPER(E16)=\"CONDICIÓN\", H16, \"\")","v":0}]
["Consultorio Médico con Lavabo",null,1,"14m²","Requerido",0,0,{"$f":"IF(AND(F17>=C17,F17>0),10,0)","v":0},null,null,"AMBIENTE",null,null,null,{"$f":"IF(UPPER(E17)=\"REQUERIDO\", 10, \"\")","v":10},{"$f":"IF(UPPER(E17)=\"REQUERIDO\", H17, \"\")","v":0}]
["Consultorio Psicología",null,1,"-","Requerido",0,0,{"$f":"IF(AND(F18>=C18,F18>0),10,0)","v":0},null,null,"AMBIENTE",null,null,null,{"$f":"IF(UPPER(E18)=\"REQUERIDO\", 10, \"\")","v":10},{"$f":"IF(UPPER(E18)=\"REQUERIDO\", H18, \"\")","v":0}]
["Consultorio Trabajo Social",null,1,"-","Requerido",0,0,{"$f":"IF(AND(F19>=C19,F19>0),10,0)","v":0},null,null,"AMBIENTE",null,null,null,{"$f":"IF(UPPER(E19)=\"REQUERIDO\", 10, \"\")","v":10},{"$f":"IF(UPPER(E19)=\"REQUERIDO\", H19, \"\")","v":0}]
["Consultorio Nutrición",null,1,"-","Requerido",0,0,{"$f":"IF(AND(F20>=C20,F20>0),10,0)","v":0},null,null,"AMBIENTE",null,null,null,{"$f":"IF(UPPER(E20)=\"REQUERIDO\", 10, \"\")","v":10},{"$f":"IF(UPPER(E20)=\"REQUERIDO\", H20, \"\")","v":0}]
["INSTALACIONES",{"$f":"B1","v":"Anx:"},{"$f":"C$1","v":"Requerido:"},"m² Util:","Tipo:","BUENO:","MALO:","Calif:","Observaciones:",null,null,null,null,null,null,null,null,null,null,null,null,null,null,null,null,null,null,null,null,null,{"$f":"SUM(O22:O23)","v":0},{"$f":"SUM(P22:P23)","v":0},0,0,{"$f":"SUM(S22:S23)","v":0},0,0,0,0,0,0,0,0,0,0,0]
["Estructura General ","DIA_EG_01",1,"-","Requerido",0,0,{"$f":"IF(AND(F22>=C22,F22>0),10,0)","v":0},null,null,"INSTALACIÓN"]
["Instalaciones Generales","DIA_IG_01",1,"-","Requerido",0,0,{"$f":"IF(AND(F23>=C23,F23>0),10,0)","v":0},null,null,"INSTALACIÓN"]
["SERVICIO DE DIÁLISIS PERITONEAL",null,null,null,null,null,null,null,null,null,null,null,null,null,null,null,null,null,null,null,null,null,null,null,null,null,null,null,null,null,{"$f":"SUM(O25:O48)","v":40},{"$f":"SUM(P25:P48)","v":0},{"$f":"SUM(Q25:Q48)","v":0},{"$f":"SUM(R25:R48)","v":0},0,0,30,0,0,0,0,0,0,0,0,0]
["ÁREA DE PROCEDIMIENTO  DE DIÁLISIS PERITONEAL",null,null,null,null,null,null,null,null,null,null,null,null,null,null,null,null,null,null,null,null,null,null,null,null,null,null,null,null,null,{"$f":"SUM(O26:O32)","v":0},{"$f":"SUM(P26:P32)","v":0},{"$f":"SUM(Q26:Q32)","v":0},0,0,{"$f":"SUM(T26:T32)","v":0},20,0,{"$f":"SUM(W26:W32)","v":0},0,0,{"$f":"SUM(Z26:Z32)","v":0},0,0,{"$f":"SUM(AC26:AC32)","v":0},0]
["ÁREA DE TRATAMIENTO",null,null,null,null,null,null,null,null,null,null,null,null,null,null,null,null,null,null,null,null,null,null,null,null,null,null,null,null,null,{"$f":"SUM(O27:O32)","v":0},{"$f":"SUM(P27:P32)","v":0},0,0,{"$f":"SUM(S27:S32)","v":0},{"$f":"SUM(T27:T32)","v":0},20,{"$f":"SUM(V27:V32)","v":0},{"$f":"SUM(W27:W32)","v":0},0,{"$f":"SUM(Y27:Y32)","v":0},{"$f":"SUM(Z27:Z32)","v":0},0,{"$f":"SUM(AB27:AB32)","v":0},{"$f":"SUM(AC27:AC32)","v":0},0]
["AMBIENTES",{"$f":"B1","v":"Anx:"},{"$f":"C$1","v":"Requerido:"},"m² Util:","Tipo:","BUENO:","MALO:","Calif:","Observaciones:",null,null,null,null,null,null,null,null,null,null,null,null,null,null,null,null,null,null,null,null,null,{"$f":"SUM(O27:O29)","v":0},{"$f":"SUM(P27:P29)","v":0},{"$f":"SUM(Q27:Q29)","v":0},0,0,0,20,0,0,0,0,0,0,0,0,0]
["Sala de procedimientos - Debe existir acuerdo con una unidad quirúrgica para realización, reparación de Fístulas y colocación de Catéteres en caso de no haber  convenio se hará requerido",null,1,"-","Condición",0,0,{"$f":"IF(AND(F28>=C28,F28>0),10,0)","v":0},null,null,"AMBIENTE",null,null,null,null,null,null,null,null,null,{"$f":"IF(UPPER(E28)=\"CONDICIÓN\", 10, 0)","v":10},{"$f":"IF(UPPER(E28)=\"CONDICIÓN\", H28, \"\")","v":0}]
["Zona de autoclave -  Se convierte en Requerido si existe Sala de Procedimientos, o sigue siendo una condición si tiene  acuerdo con una unidad externa que preste el servicio de esterilización",null,1,"-","Condición",0,0,{"$f":"IF(AND(F29>=C29,F29>0),10,0)","v":0},null,null,"AMBIENTE",null,null,null,null,null,null,null,null,null,10,0]
["INSTALACIONES",{"$f":"B1","v":"Anx:"},{"$f":"C$1","v":"Requerido:"},"m² Util:","Tipo:","BUENO:","MALO:","Calif:","Observaciones:",null,null,null,null,null,null,null,null,null,null,null,null,null,null,null,null,null,null,null,null,null,{"$f":"SUM(O31:O32)","v":0},0,0,0,0,0,0,0,0,0,0,0,0,0,0,0]
["Estructura General ","DIA_EG_01",1,"-","Condición",0,0,{"$f":"IF(AND(F31>=C31,F31>0),10,0)","v":0},null,null,"INSTALACIÓN"]
["Instalaciones Generales","DIA_IG_01",1,"-","Condición",0,0,{"$f":"IF(AND(F32>=C32,F32>0),10,0)","v":0},null,null,"INSTALACIÓN"]
["ÁREA DE APOYO Y APROVISONAMIENTO",null,null,null,null,null,null,null,null,null,null,null,null,null,null,null,null,null,null,null,null,null,null,null,null,null,null,null,null,null,{"$f":"SUM(O34:O48)","v":40},{"$f":"SUM(P34:P48)","v":0},{"$f":"SUM(Q34:Q48)","v":0},{"$f":"SUM(R34:R48)","v":0},0,0,10,0,0,0,0,0,0,0,0,0]
["Está área funcional debe estar centralizada y no debe estar en  contacto  con las  áreas de tratamiento",null,null,null,null,null,null,null,null,null,null,null,null,null,null,null,null,null,null,null,null,null,null,null,null,null,null,null,null,null,{"$f":"SUM(O35:O41)","v":20},{"$f":"SUM(P35:P41)","v":0},0,0,{"$f":"SUM(S35:S41)","v":0},{"$f":"SUM(T35:T41)","v":0},10,{"$f":"SUM(V35:V41)","v":0},{"$f":"SUM(W35:W41)","v":0},0,{"$f":"SUM(Y35:Y41)","v":0},{"$f":"SUM(Z35:Z41)","v":0},0,{"$f":"SUM(AB35:AB41)","v":0},{"$f":"SUM(AC35:AC41)","v":0},0]
["AMBIENTES",{"$f":"B1","v":"Anx:"},{"$f":"C$1","v":"Requerido:"},"m² Util:","Tipo:","BUENO:","MALO:","Calif:","Observaciones:",null,null,null,null,null,null,null,null,null,null,null,null,null,null,null,null,null,null,null,null,null,{"$f":"SUM(O36:O38)","v":20},{"$f":"SUM(P36:P38)","v":0},{"$f":"SUM(Q36:Q38)","v":0},0,0,{"$f":"SUM(T36:T38)","v":0},10,0,{"$f":"SUM(W36:W38)","v":0},0,0,{"$f":"SUM(Z36:Z38)","v":0},0,0,{"$f":"SUM(AC36:AC38)","v":0},0]
["Cuarto de limpieza con vertedero",null,1,"-","Requerido",0,0,{"$f":"IF(AND(F36>=C36,F36>0),10,0)","v":0},null,null,"AMBIENTE",null,null,null,{"$f":"IF(UPPER(E36)=\"REQUERIDO\", 10, \"\")","v":10},{"$f":"IF(UPPER(E36)=\"REQUERIDO\", H36, \"\")","v":0}]
["Almacenamiento intermedio de desechos; se hará requerido cuando el servicio  tenga más 50 puestos o camillas",null,1,"-","Condición",0,0,{"$f":"IF(AND(F37>=C37,F37>0),10,0)","v":0},null,null,"AMBIENTE",null,null,null,null,null,null,null,null,null,{"$f":"IF(UPPER(E37)=\"CONDICIÓN\", 10, 0)","v":10},{"$f":"IF(UPPER(E37)=\"CONDICIÓN\", H37, \"\")","v":0}]
["Lencería",null,1,"-","Requerido",0,0,{"$f":"IF(AND(F38>=C38,F38>0),10,0)","v":0},null,null,"AMBIENTE",null,null,null,{"$f":"IF(UPPER(E38)=\"REQUERIDO\", 10, \"\")","v":10},{"$f":"IF(UPPER(E38)=\"REQUERIDO\", H38, \"\")","v":0}]
["INSTALACIONES",{"$f":"B1","v":"Anx:"},{"$f":"C$1","v":"Requerido:"},"m² Util:","Tipo:","BUENO:","MALO:","Calif:","Observaciones:",null,null,null,null,null,null,null,null,null,null,null,null,null,null,null,null,null,null,null,null,null,{"$f":"SUM(O40:O41)","v":0},{"$f":"SUM(P40:P41)","v":0},0,0,0,0,0,0,0,0,0,0,0,0,0,0]
["Estructura General ","DIA_EG_01",1,".","Requerido",0,0,{"$f":"IF(AND(F40>=C40,F40>0),10,0)","v":0},null,null,"INSTALACIÓN"]
["Instalaciones Generales","DIA_IG_01",1,"-","Requerido",0,0,{"$f":"IF(AND(F41>=C41,F41>0),10,0)","v":0},null,null,"INSTALACIÓN"]
["ÁREA PACIENTE",null,null,null,null,null,null,null,null,null,null,null,null,null,null,null,null,null,null,null,null,null,null,null,null,null,null,null,null,null,{"$f":"SUM(O43:O48)","v":20},{"$f":"SUM(P43:P48)","v":0},0,0,{"$f":"SUM(S43:S48)","v":0},{"$f":"SUM(T43:T48)","v":0},0,{"$f":"SUM(V43:V48)","v":0},{"$f":"SUM(W43:W48)","v":0},0,{"$f":"SUM(Y43:Y48)","v":0},{"$f":"SUM(Z43:Z48)","v":0},0,{"$f":"SUM(AB43:AB48)","v":0},{"$f":"SUM(AC43:AC48)","v":0},0]
["AMBIENTES",{"$f":"B1","v":"Anx:"},{"$f":"C$1","v":"Requerido:"},"m² Util:","Tipo:","BUENO:","MALO:","Calif:","Observaciones:",null,null,null,null,null,null,null,null,null,null,null,null,null,null,null,null,null,null,null,null,null,{"$f":"SUM(O44:O45)","v":20},{"$f":"SUM(P44:P45)","v":0},0,0,{"$f":"SUM(S44:S45)","v":0},{"$f":"SUM(T44:T45)","v":0},0,{"$f":"SUM(V44:V45)","v":0},{"$f":"SUM(W44:W45)","v":0},0,{"$f":"SUM(Y44:Y45)","v":0},{"$f":"SUM(Z44:Z45)","v":0},0,{"$f":"SUM(AB44:AB45)","v":0},{"$f":"SUM(AC44:AC45)","v":0},0]
["Repostería",null,1,"-","Requerido",0,0,{"$f":"IF(AND(F44>=C44,F44>0),10,0)","v":0},null,null,"AMBIENTE",null,null,null,{"$f":"IF(UPPER(E44)=\"REQUERIDO\", 10, \"\")","v":10},{"$f":"IF(UPPER(E44)=\"REQUERIDO\", H44, \"\")","v":0}]
["Vestidor de pacientes",null,2,"8m²","Requerido",0,0,{"$f":"IF(AND(F45>=C45,F45>0),10,0)","v":0},null,null,"AMBIENTE",null,null,null,{"$f":"IF(UPPER(E45)=\"REQUERIDO\", 10, \"\")","v":10},{"$f":"IF(UPPER(E45)=\"REQUERIDO\", H45, \"\")","v":0}]
["INSTALACIONES",{"$f":"B1","v":"Anx:"},{"$f":"C$1","v":"Requerido:"},"m² Util:","Tipo:","BUENO:","MALO:","Calif:","Observaciones:",null,null,null,null,null,null,null,null,null,null,null,null,null,null,null,null,null,null,null,null,null,{"$f":"SUM(O47:O48)","v":0},0,0,0,0,0,0,0,0,0,0,0,0,0,0,0]
["Estructura General ","DIA_EG_01",1,".","Requerido",0,0,{"$f":"IF(AND(F47>=C47,F47>0),10,0)","v":0},null,null,"INSTALACIÓN"]
["Instalaciones Generales","DIA_IG_01",1,"-","Requerido",0,0,{"$f":"IF(AND(F48>=C48,F48>0),10,0)","v":0},null,null,"INSTALACIÓN"]
["SERVICIO DE DIÁLISIS PERITONEAL",null,null,null,null,null,null,null,null,null,null,null,null,null,null,null,null,null,null,null,null,null,null,null,null,null,null,null,null,null,{"$f":"SUM(O50:O64)","v":40},{"$f":"SUM(P50:P64)","v":0},0,0,{"$f":"SUM(S50:S64)","v":0},{"$f":"SUM(T50:T64)","v":0},0,{"$f":"SUM(V50:V64)","v":0},{"$f":"SUM(W50:W64)","v":0},0,{"$f":"SUM(Y50:Y64)","v":0},{"$f":"SUM(Z50:Z64)","v":0},0,{"$f":"SUM(AB50:AB64)","v":0},{"$f":"SUM(AC50:AC64)","v":0},0]
["ÁREA DE TRATAMIENTO DE DIÁLISIS PERITONEAL",null,null,null,null,null,null,null,null,null,null,null,null,null,null,null,null,null,null,null,null,null,null,null,null,null,null,null,null,null,{"$f":"SUM(O51:O64)","v":40},{"$f":"SUM(P51:P64)","v":0},0,0,{"$f":"SUM(S51:S64)","v":0},{"$f":"SUM(T51:T64)","v":0},0,{"$f":"SUM(V51:V64)","v":0},{"$f":"SUM(W51:W64)","v":0},0,{"$f":"SUM(Y51:Y64)","v":0},{"$f":"SUM(Z51:Z64)","v":0},0,{"$f":"SUM(AB51:AB64)","v":0},{"$f":"SUM(AC51:AC64)","v":0},0]
["ÁREA DE TRATAMIENTO",null,null,null,null,null,null,null,null,null,null,null,null,null,null,null,null,null,null,null,null,null,null,null,null,null,null,null,null,null,{"$f":"SUM(O52:O57)","v":20},{"$f":"SUM(P52:P57)","v":0},0,0,{"$f":"SUM(S52:S57)","v":0},{"$f":"SUM(T52:T57)","v":0},0,{"$f":"SUM(V52:V57)","v":0},{"$f":"SUM(W52:W57)","v":0},0,{"$f":"SUM(Y52:Y57)","v":0},{"$f":"SUM(Z52:Z57)","v":0},0,{"$f":"SUM(AB52:AB57)","v":0},{"$f":"SUM(AC52:AC57)","v":0},0]
["AMBIENTES",{"$f":"B1","v":"Anx:"},{"$f":"C$1","v":"Requerido:"},"m² Util:","Tipo:","BUENO:","MALO:","Calif:","Observaciones:",null,null,null,null,null,null,null,null,null,null,null,null,null,null,null,null,null,null,null,null,null,{"$f":"SUM(O52:O54)","v":20},{"$f":"SUM(P53:P54)","v":0},{"$f":"SUM(Q52:Q54)","v":0},{"$f":"SUM(R52:R54)","v":0},{"$f":"SUM(S53:S54)","v":0},{"$f":"SUM(T52:T54)","v":0},0,{"$f":"SUM(V53:V54)","v":0},{"$f":"SUM(W52:W54)","v":0},0,{"$f":"SUM(Y53:Y54)","v":0},{"$f":"SUM(Z52:Z54)","v":0},0,{"$f":"SUM(AB53:AB54)","v":0},{"$f":"SUM(AC52:AC54)","v":0},0]
["Sala de entrenamiento",null,1,"-","Requerido",0,0,{"$f":"IF(AND(F53>=C53,F53>0),10,0)","v":0},null,null,"AMBIENTE",null,null,null,{"$f":"IF(UPPER(E53)=\"REQUERIDO\", 10, 0)","v":10},{"$f":"IF(UPPER(E53)=\"REQUERIDO\", H53, \"\")","v":0}]
["Área de recambios",null,1,"-","Requerido",0,0,{"$f":"IF(AND(F54>=C54,F54>0),10,0)","v":0},null,null,"AMBIENTE",null,null,null,{"$f":"IF(UPPER(E54)=\"REQUERIDO\", 10, 0)","v":10},{"$f":"IF(UPPER(E54)=\"REQUERIDO\", H54, \"\")","v":0}]
["INSTALACIONES",{"$f":"B1","v":"Anx:"},{"$f":"C$1","v":"Requerido:"},"m² Util:","Tipo:","BUENO:","MALO:","Calif:","Observaciones:",null,null,null,null,null,null,null,null,null,null,null,null,null,null,null,null,null,null,null,null,null,{"$f":"SUM(O56:O57)","v":0},0,0,0,0,0,0,0,0,0,0,0,0,0,0,0]
["Estructura General ","DIA_EG_01",1,"-","Condición",0,0,{"$f":"IF(AND(F56>=C56,F56>0),10,0)","v":0},null,null,"INSTALACIÓN"]
["Instalaciones Generales","DIA_IG_01",1,"-","Condición",0,0,{"$f":"IF(AND(F57>=C57,F57>0),10,0)","v":0},null,null,"INSTALACIÓN"]
["ÁREA TÉCNICA",null,null,null,null,null,null,null,null,null,null,null,null,null,null,null,null,null,null,null,null,null,null,null,null,null,null,null,null,null,{"$f":"SUM(O59:O64)","v":20},{"$f":"SUM(P59:P64)","v":0},0,0,{"$f":"SUM(S59:S64)","v":0},{"$f":"SUM(T59:T64)","v":0},0,{"$f":"SUM(V59:V64)","v":0},{"$f":"SUM(W59:W64)","v":0},0,{"$f":"SUM(Y59:Y64)","v":0},{"$f":"SUM(Z59:Z64)","v":0},0,{"$f":"SUM(AB59:AB64)","v":0},{"$f":"SUM(AC59:AC64)","v":0},0]
["AMBIENTES",{"$f":"B1","v":"Anx:"},{"$f":"C$1","v":"Requerido:"},"m² Util:","Tipo:","BUENO:","MALO:","Calif:","Observaciones:",null,null,null,null,null,null,null,null,null,null,null,null,null,null,null,null,null,null,null,null,null,{"$f":"SUM(O60:O61)","v":20},{"$f":"SUM(P60:P61)","v":0},{"$f":"SUM(Q60:Q61)","v":0},0,0,0,0,0,0,0,0,0,0,0,0,0]
["Limpio",null,1,"-","Requerido",0,0,{"$f":"IF(AND(F60>=C60,F60>0),10,0)","v":0},null,null,"AMBIENTE",null,null,null,{"$f":"IF(UPPER(E60)=\"REQUERIDO\", 10, 0)","v":10},{"$f":"IF(UPPER(E60)=\"REQUERIDO\", H60, \"\")","v":0}]
["Usado",null,1,"-","Requerido",0,0,{"$f":"IF(AND(F61>=C61,F61>0),10,0)","v":0},null,null,"AMBIENTE",null,null,null,{"$f":"IF(UPPER(E61)=\"REQUERIDO\", 10, 0)","v":10},{"$f":"IF(UPPER(E61)=\"REQUERIDO\", H61, \"\")","v":0}]
["INSTALACIONES",{"$f":"B1","v":"Anx:"},{"$f":"C$1","v":"Requerido:"},"m² Util:","Tipo:","BUENO:","MALO:","Calif:","Observaciones:",null,null,null,null,null,null,null,null,null,null,null,null,null,null,null,null,null,null,null,null,null,{"$f":"SUM(O63:O64)","v":0},0,0,0,0,0,0,0,0,0,0,0,0,0,0,0]
["Estructura General ","DIA_EG_01",1,"-","Requerido",0,0,{"$f":"IF(AND(F63>=C63,F63>0),10,0)","v":0},null,null,"INSTALACIÓN"]
["Instalaciones Generales","DIA_IG_01",1,"-","Requerido",0,0,{"$f":"IF(AND(F64>=C64,F64>0),10,0)","v":0},null,null,"INSTALACIÓN"]
["SERVICIO DE DIAGNÓSTICO",null,null,null,null,null,null,null,null,null,null,null,null,null,null,null,null,null,null,null,null,null,null,null,null,null,null,null,null,null,{"$f":"SUM(O66:O82)","v":0},{"$f":"SUM(P66:P82)","v":0},0,0,{"$f":"SUM(S66:S82)","v":0},{"$f":"SUM(T66:T82)","v":0},50,{"$f":"SUM(V66:V82)","v":0},{"$f":"SUM(W66:W82)","v":0},0,{"$f":"SUM(Y66:Y82)","v":0},{"$f":"SUM(Z66:Z82)","v":0},0,{"$f":"SUM(AB66:AB82)","v":0},{"$f":"SUM(AC66:AC82)","v":0},0]
["LABORATORIO - PUESTO DE TOMA DE MUESTRAS",null,null,null,null,null,null,null,null,null,null,null,null,null,null,null,null,null,null,null,null,null,null,null,null,null,null,null,null,null,{"$f":"SUM(O68:O82)","v":0},{"$f":"SUM(P68:P82)","v":0},0,0,{"$f":"SUM(S68:S82)","v":0},{"$f":"SUM(T68:T82)","v":0},50,{"$f":"SUM(V68:V82)","v":0},{"$f":"SUM(W68:W82)","v":0},0,{"$f":"SUM(Y68:Y82)","v":0},{"$f":"SUM(Z68:Z82)","v":0},0,{"$f":"SUM(AB68:AB82)","v":0},{"$f":"SUM(AC68:AC82)","v":0},0]
["Debe existir un convenio con un Laboratorio clínico externo, licenciado por el MSP , si existiera un puesto de toma de muestras las condiciones se harán requeridas, además debe haber normas de transporte y conservación de Muestras."]
["ÁREA DE TOMA DE MUESTRAS",null,null,null,null,null,null,null,null,null,null,null,null,null,null,null,null,null,null,null,null,null,null,null,null,null,null,null,null,null,{"$f":"SUM(O69:O76)","v":0},{"$f":"SUM(P69:P76)","v":0},0,0,{"$f":"SUM(S69:S76)","v":0},{"$f":"SUM(T69:T76)","v":0},40,{"$f":"SUM(V69:V76)","v":0},{"$f":"SUM(W69:W76)","v":0},0,{"$f":"SUM(Y69:Y76)","v":0},{"$f":"SUM(Z69:Z76)","v":0},0,{"$f":"SUM(AB69:AB76)","v":0},{"$f":"SUM(AC69:AC76)","v":0},0]
["AMBIENTES",{"$f":"B1","v":"Anx:"},{"$f":"C$1","v":"Requerido:"},"m² Util:","Tipo:","BUENO:","MALO:","Calif:","Observaciones:",null,null,null,null,null,null,null,null,null,null,null,null,null,null,null,null,null,null,null,null,null,{"$f":"SUM(O70:O73)","v":0},{"$f":"SUM(P70:P73)","v":0},0,0,{"$f":"SUM(S70:S73)","v":0},{"$f":"SUM(T70:T73)","v":0},40,{"$f":"SUM(V70:V73)","v":0},{"$f":"SUM(W70:W73)","v":0},0,{"$f":"SUM(Y70:Y73)","v":0},{"$f":"SUM(Z70:Z73)","v":0},0,{"$f":"SUM(AB70:AB73)","v":0},{"$f":"SUM(AC70:AC73)","v":0},0]
["Baterías sanitarias",null,2,"-","Condición",0,0,{"$f":"IF(AND(F70>=C70,F70>0),10,0)","v":0},null,null,"AMBIENTE",null,null,null,null,null,null,null,null,null,{"$f":"IF(UPPER(E70)=\"CONDICIÓN\", 10, 0)","v":10},{"$f":"IF(UPPER(E70)=\"CONDICIÓN\", H70, \"\")","v":0}]
["Sala de espera",null,1,"9m²","Condición",0,0,{"$f":"IF(AND(F71>=C71,F71>0),10,0)","v":0},null,null,"AMBIENTE",null,null,null,null,null,null,null,null,null,10,0]
["Sala de muestras",null,1,"-","Condición",0,0,{"$f":"IF(AND(F72>=C72,F72>0),10,0)","v":0},null,null,"AMBIENTE",null,null,null,null,null,null,null,null,null,10,0]
["Usado",null,1,"-","Condición",0,0,{"$f":"IF(AND(F73>=C73,F73>0),10,0)","v":0},null,null,"AMBIENTE",null,null,null,null,null,null,null,null,null,10,0]
["INSTALACIONES",{"$f":"B1","v":"Anx:"},{"$f":"C$1","v":"Requerido:"},"m² Util:","Tipo:","BUENO:","MALO:","Calif:","Observaciones:",null,null,null,null,null,null,null,null,null,null,null,null,null,null,null,null,null,null,null,null,null,{"$f":"SUM(O75:O76)","v":0},{"$f":"SUM(P75:P76)","v":0},{"$f":"SUM(Q75:Q76)","v":0},0,0,0,0,0,0,0,0,0,0,0,0,0]
["Estructura General ","DIA_EG_01",1,"-","Condición",0,0,{"$f":"IF(AND(F75>=C75,F75>0),10,0)","v":0},null,null,"INSTALACIÓN"]
["Instalaciones Generales","DIA_IG_01",1,"-","Condición",0,0,{"$f":"IF(AND(F76>=C76,F76>0),10,0)","v":0},null,null,"INSTALACIÓN"]
["ÁREA DE PROCESAMIENTO",null,null,null,null,null,null,null,null,null,null,null,null,null,null,null,null,null,null,null,null,null,null,null,null,null,null,null,null,null,{"$f":"SUM(O78:O82)","v":0},{"$f":"SUM(P78:P82)","v":0},0,0,{"$f":"SUM(S78:S82)","v":0},{"$f":"SUM(T78:T82)","v":0},10,{"$f":"SUM(V78:V82)","v":0},{"$f":"SUM(W78:W82)","v":0},0,{"$f":"SUM(Y78:Y82)","v":0},{"$f":"SUM(Z78:Z82)","v":0},0,{"$f":"SUM(AB78:AB82)","v":0},{"$f":"SUM(AC78:AC82)","v":0},0]
["AMBIENTES",{"$f":"B1","v":"Anx:"},{"$f":"C$1","v":"Requerido:"},"m² Util:","Tipo:","BUENO:","MALO:","Calif:","Observaciones:",null,null,null,null,null,null,null,null,null,null,null,null,null,null,null,null,null,null,null,null,null,{"$f":"SUM(O79:O79)","v":0},{"$f":"SUM(P79:P79)","v":0},0,0,0,0,10,0,0,0,0,0,0,0,0,0]
["Área de determinaciones rápidas/ pre análisis",null,1,"6m²","Condición",0,0,{"$f":"IF(AND(F79>=C79,F79>0),10,0)","v":0},null,null,"AMBIENTE",null,null,null,null,null,null,null,null,null,{"$f":"IF(UPPER(E79)=\"CONDICIÓN\", 10, 0)","v":10},{"$f":"IF(UPPER(E79)=\"CONDICIÓN\", H79, \"\")","v":0}]
["INSTALACIONES",{"$f":"B1","v":"Anx:"},{"$f":"C$1","v":"Requerido:"},"m² Util:","Tipo:","BUENO:","MALO:","Calif:","Observaciones:",null,null,null,null,null,null,null,null,null,null,null,null,null,null,null,null,null,null,null,null,null,{"$f":"SUM(O81:O82)","v":0},{"$f":"SUM(P81:P82)","v":0},0,0,0,0,0,0,0,0,0,0,0,0,0,0]
["Estructura General ","DIA_EG_01",1,"-","Condición",0,0,{"$f":"IF(AND(F81>=C81,F81>0),10,0)","v":0},null,null,"INSTALACIÓN"]
["Instalaciones Generales","DIA_IG_01",1,"-","Condición",0,0,{"$f":"IF(AND(F82>=C82,F82>0),10,0)","v":0},null,null,"INSTALACIÓN"]
["SERVICIOS DE APOYO",null,null,null,null,null,null,null,null,null,null,null,null,null,null,null,null,null,null,null,null,null,null,null,null,null,null,null,null,null,{"$f":"SUM(O84:O131)","v":70},{"$f":"SUM(P84:P131)","v":0},10,0,{"$f":"SUM(S84:S131)","v":20},{"$f":"SUM(T84:T131)","v":0},{"$f":"SUM(U84:U131)","v":40},{"$f":"SUM(V84:V131)","v":0},{"$f":"SUM(W84:W131)","v":0},0,{"$f":"SUM(Y84:Y131)","v":0},{"$f":"SUM(Z84:Z131)","v":0},0,{"$f":"SUM(AB84:AB131)","v":0},{"$f":"SUM(AC84:AC131)","v":0},0]
["FARMACIA",null,null,null,null,null,null,null,null,null,null,null,null,null,null,null,null,null,null,null,null,null,null,null,null,null,null,null,null,null,{"$f":"SUM(O85:O109)","v":50},{"$f":"SUM(P85:P109)","v":0},0,0,{"$f":"SUM(S85:S109)","v":20},{"$f":"SUM(T85:T109)","v":0},30,{"$f":"SUM(V85:V109)","v":0},{"$f":"SUM(W85:W109)","v":0},0,{"$f":"SUM(Y85:Y109)","v":0},{"$f":"SUM(Z85:Z109)","v":0},0,{"$f":"SUM(AB85:AB109)","v":0},{"$f":"SUM(AC85:AC109)","v":0},0]
["ÁREA ADMINISTRATIVA Y DE PERSONAL",null,null,null,null,null,null,null,null,null,null,null,null,null,null,null,null,null,null,null,null,null,null,null,null,null,null,null,null,null,{"$f":"SUM(O86:O93)","v":10},{"$f":"SUM(P86:P93)","v":0},0,0,{"$f":"SUM(S86:S93)","v":10},{"$f":"SUM(T86:T93)","v":0},20,{"$f":"SUM(V86:V93)","v":0},{"$f":"SUM(W86:W93)","v":0},0,{"$f":"SUM(Y86:Y93)","v":0},{"$f":"SUM(Z86:Z93)","v":0},0,{"$f":"SUM(AB86:AB93)","v":0},{"$f":"SUM(AC86:AC93)","v":0},0]
["AMBIENTES",{"$f":"B1","v":"Anx:"},{"$f":"C$1","v":"Requerido:"},"m² Util:","Tipo:","BUENO:","MALO:","Calif:","Observaciones:",null,null,null,null,null,null,null,null,null,null,null,null,null,null,null,null,null,null,null,null,null,{"$f":"SUM(O87:O90)","v":10},{"$f":"SUM(P87:P90)","v":0},0,0,{"$f":"SUM(S87:S90)","v":10},{"$f":"SUM(T87:T90)","v":0},20,{"$f":"SUM(V87:V90)","v":0},{"$f":"SUM(W87:W90)","v":0},0,{"$f":"SUM(Y87:Y90)","v":0},{"$f":"SUM(Z87:Z90)","v":0},0,{"$f":"SUM(AB87:AB90)","v":0},{"$f":"SUM(AC87:AC90)","v":0},0]
["Baño de personal",null,2,"-","Deseable",0,0,{"$f":"IF(AND(F87>=C87,F87>0),10,0)","v":0},null,null,"AMBIENTE",null,null,null,null,null,null,null,{"$f":"IF(UPPER(E87)=\"DESEABLE\", 10, 0)","v":10},{"$f":"IF(UPPER(E87)=\"DESEABLE\", H87, \"\")","v":0}]
["Despacho Químico",null,1,"-","Requerido",0,0,{"$f":"IF(AND(F88>=C88,F88>0),10,0)","v":0},null,null,"AMBIENTE",null,null,null,{"$f":"IF(UPPER(E88)=\"REQUERIDO\", 10, \"\")","v":10},{"$f":"IF(UPPER(E88)=\"REQUERIDO\", H88, \"\")","v":0}]
["Secretaría",null,1,"-","Condición",0,0,{"$f":"IF(AND(F89>=C89,F89>0),10,0)","v":0},null,null,"AMBIENTE",null,null,null,null,null,null,null,null,null,{"$f":"IF(UPPER(E89)=\"CONDICIÓN\", 10, 0)","v":10},{"$f":"IF(UPPER(E89)=\"CONDICIÓN\", H89, \"\")","v":0}]
["Trabajo Administrativo",null,1,"-","Condición",0,0,{"$f":"IF(AND(F90>=C90,F90>0),10,0)","v":0},null,null,"AMBIENTE",null,null,null,null,null,null,null,null,null,10,0]
["INSTALACIONES",{"$f":"B1","v":"Anx:"},{"$f":"C$1","v":"Requerido:"},"m² Util:","Tipo:","BUENO:","MALO:","Calif:","Observaciones:",null,null,null,null,null,null,null,null,null,null,null,null,null,null,null,null,null,null,null,null,null,{"$f":"SUM(O92:O93)","v":0},{"$f":"SUM(P92:P93)","v":0},0,0,0,0,0,0,0,0,0,0,0,0,0,0]
["Estructura General ","DIA_EG_01",1,"-","Requerido",0,0,{"$f":"IF(AND(F92>=C92,F92>0),10,0)","v":0},null,null,"INSTALACIÓN"]
["Instalaciones Generales","DIA_IG_01",1,"-","Requerido",0,0,{"$f":"IF(AND(F93>=C93,F93>0),10,0)","v":0},null,null,"INSTALACIÓN"]
["ÁREA DE RECEPCIÓN,  ALMACENAMIENTO Y SUMINISTRO (CON CONTROL DE ACCESO )",null,null,null,null,null,null,null,null,null,null,null,null,null,null,null,null,null,null,null,null,null,null,null,null,null,null,null,null,null,{"$f":"SUM(O95:O101)","v":10},{"$f":"SUM(P95:P101)","v":0},0,0,{"$f":"SUM(S95:S101)","v":10},{"$f":"SUM(T95:T101)","v":0},10,{"$f":"SUM(V95:V101)","v":0},{"$f":"SUM(W95:W101)","v":0},0,{"$f":"SUM(Y95:Y101)","v":0},{"$f":"SUM(Z95:Z101)","v":0},0,{"$f":"SUM(AB95:AB101)","v":0},{"$f":"SUM(AC95:AC101)","v":0},0]
["AMBIENTES",{"$f":"B1","v":"Anx:"},{"$f":"C$1","v":"Requerido:"},"m² Util:","Tipo:","BUENO:","MALO:","Calif:","Observaciones:",null,null,null,null,null,null,null,null,null,null,null,null,null,null,null,null,null,null,null,null,null,{"$f":"SUM(O96:O98)","v":10},{"$f":"SUM(P96:P98)","v":0},0,0,10,0,10,0,0,0,0,0,0,0,0,0]
["Bodega General",null,1,"-","Requerido",0,0,{"$f":"IF(AND(F96>=C96,F96>0),10,0)","v":0},null,null,"AMBIENTE",null,null,null,{"$f":"IF(UPPER(E96)=\"REQUERIDO\", 10, \"\")","v":10},{"$f":"IF(UPPER(E96)=\"REQUERIDO\", H96, \"\")","v":0}]
["Recepción-Admisión",null,1,"-","Condición",0,0,{"$f":"IF(AND(F97>=C97,F97>0),10,0)","v":0},null,null,"AMBIENTE",null,null,null,null,null,null,null,null,null,{"$f":"IF(UPPER(E97)=\"CONDICIÓN\", 10, 0)","v":10},{"$f":"IF(UPPER(E97)=\"CONDICIÓN\", H97, \"\")","v":0}]
["Acceso exterior",null,1,"-","Deseable",0,0,{"$f":"IF(AND(F98>=C98,F98>0),10,0)","v":0},null,null,"AMBIENTE",null,null,null,null,null,null,null,{"$f":"IF(UPPER(E98)=\"DESEABLE\", 10, 0)","v":10},{"$f":"IF(UPPER(E98)=\"DESEABLE\", H98, \"\")","v":0}]
["INSTALACIONES",{"$f":"B1","v":"Anx:"},{"$f":"C$1","v":"Requerido:"},"m² Util:","Tipo:","BUENO:","MALO:","Calif:","Observaciones:",null,null,null,null,null,null,null,null,null,null,null,null,null,null,null,null,null,null,null,null,null,{"$f":"SUM(O100:O101)","v":0},{"$f":"SUM(P100:P101)","v":0},0,0,0,0,0,0,0,0,0,0,0,0,0,0]
["Estructura General ","DIA_EG_01",1,".","Requerido",0,0,{"$f":"IF(AND(F100>=C100,F100>0),10,0)","v":0},null,null,"INSTALACIÓN"]
["Instalaciones Generales","DIA_IG_01",1,"-","Requerido",0,0,{"$f":"IF(AND(F101>=C101,F101>0),10,0)","v":0},null,null,"INSTALACIÓN"]
["ÁREA TÉCNICA",null,null,null,null,null,null,null,null,null,null,null,null,null,null,null,null,null,null,null,null,null,null,null,null,null,null,null,null,null,{"$f":"SUM(O103:O109)","v":30},{"$f":"SUM(P103:P109)","v":0},0,0,{"$f":"SUM(S103:S109)","v":0},{"$f":"SUM(T103:T109)","v":0},0,{"$f":"SUM(V103:V109)","v":0},{"$f":"SUM(W103:W109)","v":0},0,{"$f":"SUM(Y103:Y109)","v":0},{"$f":"SUM(Z103:Z109)","v":0},0,{"$f":"SUM(AB103:AB109)","v":0},{"$f":"SUM(AC103:AC109)","v":0},0]
["AMBIENTES",{"$f":"B1","v":"Anx:"},{"$f":"C$1","v":"Requerido:"},"m² Util:","Tipo:","BUENO:","MALO:","Calif:","Observaciones:",null,null,null,null,null,null,null,null,null,null,null,null,null,null,null,null,null,null,null,null,null,{"$f":"SUM(O104:O106)","v":30},{"$f":"SUM(P104:P106)","v":0},0,0,{"$f":"SUM(S104:S106)","v":0},{"$f":"SUM(T104:T106)","v":0},0,{"$f":"SUM(V104:V106)","v":0},{"$f":"SUM(W104:W106)","v":0},0,{"$f":"SUM(Y104:Y106)","v":0},{"$f":"SUM(Z104:Z106)","v":0},0,{"$f":"SUM(AB104:AB106)","v":0},{"$f":"SUM(AC104:AC106)","v":0},0]
["Zona de Dispensación Externa",null,1,"-","Requerido",0,0,{"$f":"IF(AND(F104>=C104,F104>0),10,0)","v":0},null,null,"AMBIENTE",null,null,null,{"$f":"IF(UPPER(E104)=\"REQUERIDO\", 10, \"\")","v":10},{"$f":"IF(UPPER(E104)=\"REQUERIDO\", H104, \"\")","v":0}]
["Zona de lavado de manos",null,1,"-","Requerido",0,0,{"$f":"IF(AND(F105>=C105,F105>0),10,0)","v":0},null,null,"AMBIENTE",null,null,null,{"$f":"IF(UPPER(E105)=\"REQUERIDO\", 10, \"\")","v":10},{"$f":"IF(UPPER(E105)=\"REQUERIDO\", H105, \"\")","v":0}]
["Zona de refrigeradores y congeladores",null,1,"-","Requerido",0,0,{"$f":"IF(AND(F106>=C106,F106>0),10,0)","v":0},null,null,"AMBIENTE",null,null,null,{"$f":"IF(UPPER(E106)=\"REQUERIDO\", 10, \"\")","v":10},{"$f":"IF(UPPER(E106)=\"REQUERIDO\", H106, \"\")","v":0}]
["INSTALACIONES",{"$f":"B1","v":"Anx:"},{"$f":"C$1","v":"Requerido:"},"m² Util:","Tipo:","BUENO:","MALO:","Calif:","Observaciones:",null,null,null,null,null,null,null,null,null,null,null,null,null,null,null,null,null,null,null,null,null,{"$f":"SUM(O108:O109)","v":0},0,0,0,0,0,0,0,0,0,0,0,0,0,0,0]
["Estructura General ","DIA_EG_01",1,".","Requerido",0,0,{"$f":"IF(AND(F108>=C108,F108>0),10,0)","v":0},null,null,"INSTALACIÓN"]
["Instalaciones Generales","DIA_IG_01",1,"-","Requerido",0,0,{"$f":"IF(AND(F109>=C109,F109>0),10,0)","v":0},null,null,"INSTALACIÓN"]
["INFORMÁTICA",null,null,null,null,null,null,null,null,null,null,null,null,null,null,null,null,null,null,null,null,null,null,null,null,null,null,null,null,null,{"$f":"SUM(O111:O117)","v":0},{"$f":"SUM(P111:P117)","v":0},0,0,{"$f":"SUM(S111:S117)","v":0},{"$f":"SUM(T111:T117)","v":0},10,{"$f":"SUM(V111:V117)","v":0},{"$f":"SUM(W111:W117)","v":0},0,{"$f":"SUM(Y111:Y117)","v":0},{"$f":"SUM(Z111:Z117)","v":0},0,{"$f":"SUM(AB111:AB117)","v":0},{"$f":"SUM(AC111:AC117)","v":0},0]
["ÁREA TÉCNICA",null,null,null,null,null,null,null,null,null,null,null,null,null,null,null,null,null,null,null,null,null,null,null,null,null,null,null,null,null,{"$f":"SUM(O112:O117)","v":0},{"$f":"SUM(P112:P117)","v":0},0,0,0,0,10,0,0,0,0,0,0,0,0,0]
["AMBIENTES",{"$f":"B1","v":"Anx:"},{"$f":"C$1","v":"Requerido:"},"m² Util:","Tipo:","BUENO:","MALO:","Calif:","Observaciones:",null,null,null,null,null,null,null,null,null,null,null,null,null,null,null,null,null,null,null,null,null,{"$f":"SUM(O113:O114)","v":0},{"$f":"SUM(P113:P114)","v":0},0,0,0,0,10,0,0,0,0,0,0,0,0,0]
["Zona de trabajo ",null,1,"-","Condición",0,0,{"$f":"IF(AND(F113>=C113,F113>0),10,0)","v":0},null,null,"AMBIENTE",null,null,null,null,null,null,null,null,null,{"$f":"IF(UPPER(E113)=\"CONDICIÓN\", 10, 0)","v":10},{"$f":"IF(UPPER(E113)=\"CONDICIÓN\", H113, \"\")","v":0}]
["Zona de Servidores",null,1,"-","Condición",0,0,{"$f":"IF(AND(F114>=C114,F114>0),10,0)","v":0},null,null,"INSTALACIÓN"]
["INSTALACIONES",{"$f":"B1","v":"Anx:"},{"$f":"C$1","v":"Requerido:"},"m² Util:","Tipo:","BUENO:","MALO:","Calif:","Observaciones:",null,null,null,null,null,null,null,null,null,null,null,null,null,null,null,null,null,null,null,null,null,{"$f":"SUM(O116:O117)","v":0},{"$f":"SUM(P116:P117)","v":0},0,0,0,0,0,0,0,0,0,0,0,0,0,0]
["Estructura General ","DIA_EG_01",1,"-","Condición",0,0,{"$f":"IF(AND(F116>=C116,F116>0),10,0)","v":0},null,null,"INSTALACIÓN"]
["Instalaciones Generales","DIA_IG_01",1,"-","Condición",0,0,{"$f":"IF(AND(F117>=C117,F117>0),10,0)","v":0},null,null,"INSTALACIÓN"]
["REGISTROS Y ARCHIVOS CLÍNICOS",null,null,null,null,null,null,null,null,null,null,null,null,null,null,null,null,null,null,null,null,null,null,null,null,null,null,null,null,null,{"$f":"SUM(O119:O131)","v":20},{"$f":"SUM(P119:P131)","v":0},10,0,0,0,0,0,0,0,0,0,0,0,0,0]
["ÁREA DE ARCHIVO",null,null,null,null,null,null,null,null,null,null,null,null,null,null,null,null,null,null,null,null,null,null,null,null,null,null,null,null,null,{"$f":"SUM(O120:O124)","v":10},{"$f":"SUM(P120:P124)","v":0},0,0,0,0,0,0,0,0,0,0,0,0,0,0]
["AMBIENTES",{"$f":"B1","v":"Anx:"},{"$f":"C$1","v":"Requerido:"},"m² Util:","Tipo:","BUENO:","MALO:","Calif:","Observaciones:",null,null,null,null,null,null,null,null,null,null,null,null,null,null,null,null,null,null,null,null,null,{"$f":"SUM(O121:O121)","v":10},{"$f":"SUM(P121:P121)","v":0},0,0,0,0,0,0,0,0,0,0,0,0,0,0]
["Archivo de historias",null,1,"-","Requerido",0,0,{"$f":"IF(AND(F121>=C121,F121>0),10,0)","v":0},null,null,"AMBIENTE",null,null,null,{"$f":"IF(UPPER(E121)=\"REQUERIDO\", 10, \"\")","v":10},{"$f":"IF(UPPER(E121)=\"REQUERIDO\", H121, \"\")","v":0}]
["INSTALACIONES",{"$f":"B1","v":"Anx:"},{"$f":"C$1","v":"Requerido:"},"m² Util:","Tipo:",{"$f":"F$1","v":"BUENO:"},"MALO:","Calif:","Observaciones:",null,null,null,null,null,null,null,null,null,null,null,null,null,null,null,null,null,null,null,null,null,{"$f":"SUM(O123:O124)","v":0},0,0,0,0,0,0,0,0,0,0,0,0,0,0,0]
["Estructura General ","DIA_EG_01",1,".","Requerido",0,0,{"$f":"IF(AND(F123>=C123,F123>0),10,0)","v":0},null,null,"INSTALACIÓN"]
["Instalaciones Generales","DIA_IG_01",1,"-","Requerido",0,0,{"$f":"IF(AND(F124>=C124,F124>0),10,0)","v":0},null,null,"INSTALACIÓN"]
["ÁREA TÉCNICA",null,null,null,null,null,null,null,null,null,null,null,null,null,null,null,null,null,null,null,null,null,null,null,null,null,null,null,null,null,{"$f":"SUM(O126:O131)","v":10},{"$f":"SUM(P126:P131)","v":0},10,0,0,0,0,0,0,0,0,0,0,0,0,0]
["AMBIENTES",{"$f":"B1","v":"Anx:"},{"$f":"C$1","v":"Requerido:"},"m² Util:","Tipo:","BUENO:","MALO:","Calif:","Observaciones:",null,null,null,null,null,null,null,null,null,null,null,null,null,null,null,null,null,null,null,null,null,{"$f":"SUM(O127:O128)","v":10},{"$f":"SUM(P127:P128)","v":0},10,0,0,0,0,0,0,0,0,0,0,0,0,0]
["Escaneado ",null,1,"-","Opcional",0,0,{"$f":"IF(AND(F127>=C127,F127>0),10,0)","v":0},null,null,"AMBIENTE",null,null,null,null,null,{"$f":"IF(UPPER(E127)=\"OPCIONAL\", 10, 0)","v":10},{"$f":"IF(UPPER(E127)=\"OPCIONAL\", H127, \"\")","v":0}]
["Zona de trabajo ",null,1,"-","Requerido",0,0,{"$f":"IF(AND(F128>=C128,F128>0),10,0)","v":0},null,null,"AMBIENTE",null,null,null,{"$f":"IF(UPPER(E128)=\"REQUERIDO\", 10, \"\")","v":10},{"$f":"IF(UPPER(E128)=\"REQUERIDO\", H128, \"\")","v":0}]
["INSTALACIONES",{"$f":"B1","v":"Anx:"},{"$f":"C$1","v":"Requerido:"},"m² Util:","Tipo:","BUENO:","MALO:","Calif:","Observaciones:",null,null,null,null,null,null,null,null,null,null,null,null,null,null,null,null,null,null,null,null,null,{"$f":"SUM(O130:O131)","v":0},0,0,0,0,0,0,0,0,0,0,0,0,0,0,0]
["Estructura General ","DIA_EG_01",1,"-","Requerido",0,0,{"$f":"IF(AND(F130>=C130,F130>0),10,0)","v":0},null,null,"INSTALACIÓN"]
["Instalaciones Generales","DIA_IG_01",1,"-","Requerido",0,0,{"$f":"IF(AND(F131>=C131,F131>0),10,0)","v":0},null,null,"INSTALACIÓN"]
["SERVICIO DE ADMINISTRACIÓN",null,null,null,null,null,null,null,null,null,null,null,null,null,null,null,null,null,null,null,null,null,null,null,null,null,null,null,null,null,{"$f":"SUM(O133:O162)","v":40},{"$f":"SUM(P133:P162)","v":0},0,0,{"$f":"SUM(S133:S162)","v":0},{"$f":"SUM(T133:T162)","v":0},50,{"$f":"SUM(V133:V162)","v":0},{"$f":"SUM(W133:W162)","v":0},0,{"$f":"SUM(Y133:Y162)","v":0},{"$f":"SUM(Z133:Z162)","v":0},0,{"$f":"SUM(AB133:AB162)","v":0},{"$f":"SUM(AC133:AC162)","v":0},0]
["DIRECCIÓN Y GESTIÓN ADMINISTRATIVA",null,null,null,null,null,null,null,null,null,null,null,null,null,null,null,null,null,null,null,null,null,null,null,null,null,null,null,null,null,{"$f":"SUM(O134:O162)","v":40},{"$f":"SUM(P134:P162)","v":0},0,0,{"$f":"SUM(S134:S162)","v":0},{"$f":"SUM(T134:T162)","v":0},50,{"$f":"SUM(V134:V162)","v":0},{"$f":"SUM(W134:W162)","v":0},0,{"$f":"SUM(Y134:Y162)","v":0},{"$f":"SUM(Z134:Z162)","v":0},0,{"$f":"SUM(AB134:AB162)","v":0},{"$f":"SUM(AC134:AC162)","v":0},0]
["DIRECCIÓN",null,null,null,null,null,null,null,null,null,null,null,null,null,null,null,null,null,null,null,null,null,null,null,null,null,null,null,null,null,{"$f":"SUM(O135:O142)","v":30},{"$f":"SUM(P135:P142)","v":0},0,0,{"$f":"SUM(S135:S142)","v":0},{"$f":"SUM(T135:T142)","v":0},10,{"$f":"SUM(V135:V142)","v":0},{"$f":"SUM(W135:W142)","v":0},0,{"$f":"SUM(Y135:Y142)","v":0},{"$f":"SUM(Z135:Z142)","v":0},0,{"$f":"SUM(AB135:AB142)","v":0},{"$f":"SUM(AC135:AC142)","v":0},0]
["AMBIENTES",{"$f":"B1","v":"Anx:"},{"$f":"C$1","v":"Requerido:"},"m² Util:","Tipo:","BUENO:","MALO:","Calif:","Observaciones:",null,null,null,null,null,null,null,null,null,null,null,null,null,null,null,null,null,null,null,null,null,{"$f":"SUM(O136:O139)","v":30},{"$f":"SUM(P136:P139)","v":0},{"$f":"SUM(Q136:Q139)","v":0},0,0,{"$f":"SUM(T136:T139)","v":0},10,0,{"$f":"SUM(W136:W139)","v":0},0,0,{"$f":"SUM(Z136:Z139)","v":0},0,0,{"$f":"SUM(AC136:AC139)","v":0},0]
["Despacho de Director ",null,1,"-","Requerido",0,0,{"$f":"IF(AND(F136>=C136,F136>0),10,0)","v":0},null,null,"AMBIENTE",null,null,null,{"$f":"IF(UPPER(E136)=\"REQUERIDO\", 10, \"\")","v":10},{"$f":"IF(UPPER(E136)=\"REQUERIDO\", H136, \"\")","v":0}]
["Sala de espera",null,1,"-","Condición",0,0,{"$f":"IF(AND(F137>=C137,F137>0),10,0)","v":0},null,null,"AMBIENTE",null,null,null,null,null,null,null,null,null,{"$f":"IF(UPPER(E137)=\"CONDICIÓN\", 10, 0)","v":10},{"$f":"IF(UPPER(E137)=\"CONDICIÓN\", H137, \"\")","v":0}]
["Secretaría",null,1,"-","Requerido",0,0,{"$f":"IF(AND(F138>=C138,F138>0),10,0)","v":0},null,null,"AMBIENTE",null,null,null,{"$f":"IF(UPPER(E138)=\"REQUERIDO\", 10, \"\")","v":10},{"$f":"IF(UPPER(E138)=\"REQUERIDO\", H138, \"\")","v":0}]
["Despacho de Jefe de Enfermeras",null,1,"-","Requerido",0,0,{"$f":"IF(AND(F139>=C139,F139>0),10,0)","v":0},null,null,"AMBIENTE",null,null,null,{"$f":"IF(UPPER(E139)=\"REQUERIDO\", 10, \"\")","v":10},{"$f":"IF(UPPER(E139)=\"REQUERIDO\", H139, \"\")","v":0}]
["INSTALACIONES",{"$f":"B1","v":"Anx:"},{"$f":"C$1","v":"Requerido:"},"m² Util:","Tipo:","BUENO:","MALO:","Calif:","Observaciones:",null,null,null,null,null,null,null,null,null,null,null,null,null,null,null,null,null,null,null,null,null,{"$f":"SUM(O141:O142)","v":0},0,0,0,0,0,0,0,0,0,0,0,0,0,0,0]
["Estructura General ","DIA_EG_01",1,"-","Requerido",0,0,{"$f":"IF(AND(F141>=C141,F141>0),10,0)","v":0},null,null,"INSTALACIÓN"]
["Instalaciones Generales","DIA_IG_01",1,"-","Requerido",0,0,{"$f":"IF(AND(F142>=C142,F142>0),10,0)","v":0},null,null,"INSTALACIÓN"]
["DIRECCIÓN DE TALENTO HUMANO",null,null,null,null,null,null,null,null,null,null,null,null,null,null,null,null,null,null,null,null,null,null,null,null,null,null,null,null,null,{"$f":"SUM(O144:O148)","v":0},{"$f":"SUM(P144:P148)","v":0},0,0,{"$f":"SUM(S144:S148)","v":0},{"$f":"SUM(T144:T148)","v":0},10,{"$f":"SUM(V144:V148)","v":0},{"$f":"SUM(W144:W148)","v":0},0,{"$f":"SUM(Y144:Y148)","v":0},{"$f":"SUM(Z144:Z148)","v":0},0,{"$f":"SUM(AB144:AB148)","v":0},{"$f":"SUM(AC144:AC148)","v":0},0]
["AMBIENTES",{"$f":"B1","v":"Anx:"},{"$f":"C$1","v":"Requerido:"},"m² Util:","Tipo:","BUENO:","MALO:","Calif:","Observaciones:",null,null,null,null,null,null,null,null,null,null,null,null,null,null,null,null,null,null,null,null,null,{"$f":"SUM(O145:O145)","v":0},{"$f":"SUM(P145:P145)","v":0},0,0,{"$f":"SUM(S145:S145)","v":0},{"$f":"SUM(T145:T145)","v":0},10,{"$f":"SUM(V145:V145)","v":0},{"$f":"SUM(W145:W145)","v":0},0,{"$f":"SUM(Y145:Y145)","v":0},{"$f":"SUM(Z145:Z145)","v":0},0,{"$f":"SUM(AB145:AB145)","v":0},{"$f":"SUM(AC145:AC145)","v":0},0]
["Despacho de Responsable",null,1,"-","Condición",0,0,{"$f":"IF(AND(F145>=C145,F145>0),10,0)","v":0},null,null,"AMBIENTE",null,null,null,null,null,null,null,null,null,{"$f":"IF(UPPER(E145)=\"CONDICIÓN\", 10, 0)","v":10},{"$f":"IF(UPPER(E145)=\"CONDICIÓN\", H145, \"\")","v":0}]
["INSTALACIONES",{"$f":"B1","v":"Anx:"},{"$f":"C$1","v":"Requerido:"},"m² Util:","Tipo:","BUENO:","MALO:","Calif:","Observaciones:",null,null,null,null,null,null,null,null,null,null,null,null,null,null,null,null,null,null,null,null,null,{"$f":"SUM(O147:O148)","v":0},0,0,0,0,0,0,0,0,0,0,0,0,0,0,0]
["Estructura General ","DIA_EG_01",1,".","Condición",0,0,{"$f":"IF(AND(F147>=C147,F147>0),10,0)","v":0},null,null,"INSTALACIÓN"]
["Instalaciones Generales","DIA_IG_01",1,"-","Condición",0,0,{"$f":"IF(AND(F148>=C148,F148>0),10,0)","v":0},null,null,"INSTALACIÓN"]
["DIRECCIÓN ADMINISTRATIVO-FINANCIERA",null,null,null,null,null,null,null,null,null,null,null,null,null,null,null,null,null,null,null,null,null,null,null,null,null,null,null,null,null,{"$f":"SUM(O150:O154)","v":0},{"$f":"SUM(P150:P154)","v":0},0,0,{"$f":"SUM(S150:S154)","v":0},{"$f":"SUM(T150:T154)","v":0},10,{"$f":"SUM(V150:V154)","v":0},{"$f":"SUM(W150:W154)","v":0},0,{"$f":"SUM(Y150:Y154)","v":0},{"$f":"SUM(Z150:Z154)","v":0},0,{"$f":"SUM(AB150:AB154)","v":0},{"$f":"SUM(AC150:AC154)","v":0},0]
["AMBIENTES",{"$f":"B1","v":"Anx:"},{"$f":"C$1","v":"Requerido:"},"m² Util:","Tipo:","BUENO:","MALO:","Calif:","Observaciones:",null,null,null,null,null,null,null,null,null,null,null,null,null,null,null,null,null,null,null,null,null,{"$f":"SUM(O151:O151)","v":0},{"$f":"SUM(P151:P151)","v":0},0,0,0,0,10,0,0,0,0,0,0,0,0,0]
["Zona de trabajo de Técnico financiero",null,1,"-","Condición",0,0,{"$f":"IF(AND(F151>=C151,F151>0),10,0)","v":0},null,null,"AMBIENTE",null,null,null,null,null,null,null,null,null,{"$f":"IF(UPPER(E151)=\"CONDICIÓN\", 10, 0)","v":10},{"$f":"IF(UPPER(E151)=\"CONDICIÓN\", H151, \"\")","v":0}]
["INSTALACIONES",{"$f":"B1","v":"Anx:"},{"$f":"C$1","v":"Requerido:"},"m² Util:","Tipo:","BUENO:","MALO:","Calif:","Observaciones:",null,null,null,null,null,null,null,null,null,null,null,null,null,null,null,null,null,null,null,null,null,{"$f":"SUM(O153:O154)","v":0},0,0,0,0,0,0,0,0,0,0,0,0,0,0,0]
["Estructura General ","DIA_EG_01",1,".","Condición",0,0,{"$f":"IF(AND(F153>=C153,F153>0),10,0)","v":0},null,null,"INSTALACIÓN"]
["Instalaciones Generales","DIA_IG_01",1,"-","Condición",0,0,{"$f":"IF(AND(F154>=C154,F154>0),10,0)","v":0},null,null,"INSTALACIÓN"]
["ZONA DE APOYO DE LA DIRECCIÓN ",null,null,null,null,null,null,null,null,null,null,null,null,null,null,null,null,null,null,null,null,null,null,null,null,null,null,null,null,null,{"$f":"SUM(O156:O162)","v":10},{"$f":"SUM(P156:P162)","v":0},0,0,{"$f":"SUM(S156:S162)","v":0},{"$f":"SUM(T156:T162)","v":0},20,{"$f":"SUM(V156:V162)","v":0},{"$f":"SUM(W156:W162)","v":0},0,{"$f":"SUM(Y156:Y162)","v":0},{"$f":"SUM(Z156:Z162)","v":0},0,{"$f":"SUM(AB156:AB162)","v":0},{"$f":"SUM(AC156:AC162)","v":0},0]
["AMBIENTES",{"$f":"B1","v":"Anx:"},{"$f":"C$1","v":"Requerido:"},"m² Util:","Tipo:","BUENO:","MALO:","Calif:","Observaciones:",null,null,null,null,null,null,null,null,null,null,null,null,null,null,null,null,null,null,null,null,null,{"$f":"SUM(O157:O159)","v":10},{"$f":"SUM(P157:P159)","v":0},0,0,{"$f":"SUM(S157:S159)","v":0},{"$f":"SUM(T157:T159)","v":0},20,{"$f":"SUM(V157:V159)","v":0},{"$f":"SUM(W157:W159)","v":0},0,{"$f":"SUM(Y157:Y159)","v":0},{"$f":"SUM(Z157:Z159)","v":0},0,{"$f":"SUM(AB157:AB159)","v":0},{"$f":"SUM(AC157:AC159)","v":0},0]
["Baño de personal",null,2,"-","Requerido",0,0,{"$f":"IF(AND(F157>=C157,F157>0),10,0)","v":0},null,null,"AMBIENTE",null,null,null,{"$f":"IF(UPPER(E157)=\"REQUERIDO\", 10, \"\")","v":10},{"$f":"IF(UPPER(E157)=\"REQUERIDO\", H157, \"\")","v":0}]
["Cafetería",null,1,"-","Condición",0,0,{"$f":"IF(AND(F158>=C158,F158>0),10,0)","v":0},null,null,"AMBIENTE",null,null,null,null,null,null,null,null,null,{"$f":"IF(UPPER(E158)=\"CONDICIÓN\", 10, 0)","v":10},{"$f":"IF(UPPER(E158)=\"CONDICIÓN\", H158, \"\")","v":0}]
["Sala de reuniones",null,1,"-","Condición",0,0,{"$f":"IF(AND(F159>=C159,F159>0),10,0)","v":0},null,null,"AMBIENTE",null,null,null,null,null,null,null,null,null,10,0]
["INSTALACIONES",{"$f":"B1","v":"Anx:"},{"$f":"C$1","v":"Requerido:"},"m² Util:","Tipo:","BUENO:","MALO:","Calif:","Observaciones:",null,null,null,null,null,null,null,null,null,null,null,null,null,null,null,null,null,null,null,null,null,{"$f":"SUM(O161:O162)","v":0},0,0,0,0,0,0,0,0,0,0,0,0,0,0,0]
["Estructura General ","DIA_EG_01",1,"-","Requerido",0,0,{"$f":"IF(AND(F161>=C161,F161>0),10,0)","v":0},null,null,"INSTALACIÓN"]
["Instalaciones Generales","DIA_IG_01",1,"-","Requerido",0,0,{"$f":"IF(AND(F162>=C162,F162>0),10,0)","v":0},null,null,"INSTALACIÓN"]
["SERVICIOS GENERALES",null,null,null,null,null,null,null,null,null,null,null,null,null,null,null,null,null,null,null,null,null,null,null,null,null,null,null,null,null,{"$f":"SUM(O164:O209)","v":70},{"$f":"SUM(P164:P209)","v":0},{"$f":"SUM(Q164:Q209)","v":10},0,{"$f":"SUM(S164:S209)","v":0},{"$f":"SUM(T164:T209)","v":0},10,{"$f":"SUM(V164:V209)","v":0},{"$f":"SUM(W164:W209)","v":0},0,{"$f":"SUM(Y164:Y209)","v":0},{"$f":"SUM(Z164:Z209)","v":0},0,{"$f":"SUM(AB164:AB209)","v":0},{"$f":"SUM(AC164:AC209)","v":20},{"$f":"SUM(AD164:AD209)","v":0}]
["BODEGA",null,null,null,null,null,null,null,null,null,null,null,null,null,null,null,null,null,null,null,null,null,null,null,null,null,null,null,null,null,{"$f":"SUM(O165:O177)","v":10},{"$f":"SUM(P165:P177)","v":0},{"$f":"SUM(Q165:Q177)","v":10},{"$f":"SUM(R165:R177)","v":0},0,0,0,0,0,0,0,0,0,0,0,0]
["ÁREA DE ACCESO DE RECEPCION",null,null,null,null,null,null,null,null,null,null,null,null,null,null,null,null,null,null,null,null,null,null,null,null,null,null,null,null,null,{"$f":"SUM(O166:O171)","v":0},{"$f":"SUM(P166:P171)","v":0},10,0,{"$f":"SUM(S166:S171)","v":0},{"$f":"SUM(T166:T171)","v":0},0,{"$f":"SUM(V166:V171)","v":0},{"$f":"SUM(W166:W171)","v":0},0,{"$f":"SUM(Y166:Y171)","v":0},{"$f":"SUM(Z166:Z171)","v":0},0,{"$f":"SUM(AB166:AB171)","v":0},{"$f":"SUM(AC166:AC171)","v":0},0]
["AMBIENTES",{"$f":"B1","v":"Anx:"},{"$f":"C$1","v":"Requerido:"},"m² Util:","Tipo:","BUENO:","MALO:","Calif:","Observaciones:",null,null,null,null,null,null,null,null,null,null,null,null,null,null,null,null,null,null,null,null,null,{"$f":"SUM(O167:O168)","v":0},{"$f":"SUM(P167:P168)","v":0},10,0,{"$f":"SUM(S167:S168)","v":0},{"$f":"SUM(T167:T168)","v":0},0,{"$f":"SUM(V167:V168)","v":0},{"$f":"SUM(W167:W168)","v":0},0,{"$f":"SUM(Y167:Y168)","v":0},{"$f":"SUM(Z167:Z168)","v":0},0,{"$f":"SUM(AB167:AB168)","v":0},{"$f":"SUM(AC167:AC168)","v":0},0]
["Muelle de descarga",null,1,"-","Opcional",0,0,{"$f":"IF(AND(F167>=C167,F167>0),10,0)","v":0},null,null,"INSTALACIÓN"]
["Recepción-Admisión",null,1,"6m²","Opcional",0,0,{"$f":"IF(AND(F168>=C168,F168>0),10,0)","v":0},null,null,"AMBIENTE",null,null,null,null,null,{"$f":"IF(UPPER(E168)=\"OPCIONAL\", 10, 0)","v":10},{"$f":"IF(UPPER(E168)=\"OPCIONAL\", H168, \"\")","v":0}]
["INSTALACIONES",{"$f":"B1","v":"Anx:"},{"$f":"C$1","v":"Requerido:"},"m² Util:","Tipo:","BUENO:","MALO:","Calif:","Observaciones:",null,null,null,null,null,null,null,null,null,null,null,null,null,null,null,null,null,null,null,null,null,{"$f":"SUM(O170:O171)","v":0},0,0,0,0,0,0,0,0,0,0,0,0,0,0,0]
["Estructura General ","DIA_EG_01",1,"-","Opcional",0,0,{"$f":"IF(AND(F170>=C170,F170>0),10,0)","v":0},null,null,"INSTALACIÓN"]
["Instalaciones Generales","DIA_IG_01",1,"-","Opcional",0,0,{"$f":"IF(AND(F171>=C171,F171>0),10,0)","v":0},null,null,"INSTALACIÓN"]
["ÁREA DE ALMACENES",null,null,null,null,null,null,null,null,null,null,null,null,null,null,null,null,null,null,null,null,null,null,null,null,null,null,null,null,null,{"$f":"SUM(O173:O177)","v":10},{"$f":"SUM(P173:P177)","v":0},0,0,{"$f":"SUM(S173:S177)","v":0},{"$f":"SUM(T173:T177)","v":0},0,{"$f":"SUM(V173:V177)","v":0},{"$f":"SUM(W173:W177)","v":0},0,{"$f":"SUM(Y173:Y177)","v":0},{"$f":"SUM(Z173:Z177)","v":0},0,{"$f":"SUM(AB173:AB177)","v":0},{"$f":"SUM(AC173:AC177)","v":0},0]
["AMBIENTES",{"$f":"B1","v":"Anx:"},{"$f":"C$1","v":"Requerido:"},"m² Util:","Tipo:","BUENO:","MALO:","Calif:","Observaciones:",null,null,null,null,null,null,null,null,null,null,null,null,null,null,null,null,null,null,null,null,null,{"$f":"SUM(O174:O174)","v":10},{"$f":"SUM(P174:P174)","v":0},0,0,{"$f":"SUM(S174:S174)","v":0},{"$f":"SUM(T174:T174)","v":0},0,{"$f":"SUM(V174:V174)","v":0},{"$f":"SUM(W174:W174)","v":0},0,{"$f":"SUM(Y174:Y174)","v":0},{"$f":"SUM(Z174:Z174)","v":0},0,{"$f":"SUM(AB174:AB174)","v":0},{"$f":"SUM(AC174:AC174)","v":0},0]
["Bodega General",null,1,"-","Requerido",0,0,{"$f":"IF(AND(F174>=C174,F174>0),10,0)","v":0},null,null,"AMBIENTE",null,null,null,{"$f":"IF(UPPER(E174)=\"REQUERIDO\", 10, \"\")","v":10},{"$f":"IF(UPPER(E174)=\"REQUERIDO\", H174, \"\")","v":0}]
["INSTALACIONES",{"$f":"B1","v":"Anx:"},{"$f":"C$1","v":"Requerido:"},"m² Util:","Tipo:","BUENO:","MALO:","Calif:","Observaciones:",null,null,null,null,null,null,null,null,null,null,null,null,null,null,null,null,null,null,null,null,null,{"$f":"SUM(O176:O177)","v":0},0,0,0,0,0,0,0,0,0,0,0,0,0,0,0]
["Estructura General ","DIA_EG_01",1,"-","Requerido",0,0,{"$f":"IF(AND(F176>=C176,F176>0),10,0)","v":0},null,null,"INSTALACIÓN"]
["Instalaciones Generales","DIA_IG_01",1,"-","Requerido",0,0,{"$f":"IF(AND(F177>=C177,F177>0),10,0)","v":0},null,null,"INSTALACIÓN"]
["LIMPIEZA",null,null,null,null,null,null,null,null,null,null,null,null,null,null,null,null,null,null,null,null,null,null,null,null,null,null,null,null,null,{"$f":"SUM(O179:O184)","v":10},{"$f":"SUM(P179:P184)","v":0},0,0,{"$f":"SUM(S179:S184)","v":0},{"$f":"SUM(T179:T184)","v":0},0,{"$f":"SUM(V179:V184)","v":0},{"$f":"SUM(W179:W184)","v":0},0,{"$f":"SUM(Y179:Y184)","v":0},{"$f":"SUM(Z179:Z184)","v":0},0,{"$f":"SUM(AB179:AB184)","v":0},{"$f":"SUM(AC179:AC184)","v":0},0]
["ÁREA DE ALMACENES DE PRODUCTOS Y EQUIPOS DE LIMPIEZA",null,null,null,null,null,null,null,null,null,null,null,null,null,null,null,null,null,null,null,null,null,null,null,null,null,null,null,null,null,{"$f":"SUM(O180:O184)","v":10},{"$f":"SUM(P180:P184)","v":0},0,0,{"$f":"SUM(S180:S184)","v":0},{"$f":"SUM(T180:T184)","v":0},0,{"$f":"SUM(V180:V184)","v":0},{"$f":"SUM(W180:W184)","v":0},0,{"$f":"SUM(Y180:Y184)","v":0},{"$f":"SUM(Z180:Z184)","v":0},0,{"$f":"SUM(AB180:AB184)","v":0},{"$f":"SUM(AC180:AC184)","v":0},0]
["AMBIENTES",{"$f":"B1","v":"Anx:"},{"$f":"C$1","v":"Requerido:"},"m² Util:","Tipo:","BUENO:","MALO:","Calif:","Observaciones:",null,null,null,null,null,null,null,null,null,null,null,null,null,null,null,null,null,null,null,null,null,{"$f":"SUM(O181:O181)","v":10},{"$f":"SUM(P181:P181)","v":0},0,0,{"$f":"SUM(S181:S181)","v":0},{"$f":"SUM(T181:T181)","v":0},0,{"$f":"SUM(V181:V181)","v":0},{"$f":"SUM(W181:W181)","v":0},0,{"$f":"SUM(Y181:Y181)","v":0},{"$f":"SUM(Z181:Z181)","v":0},0,{"$f":"SUM(AB181:AB181)","v":0},{"$f":"SUM(AC181:AC181)","v":0},0]
["Bodega",null,1,"-","Requerido",0,0,{"$f":"IF(AND(F181>=C181,F181>0),10,0)","v":0},null,null,"AMBIENTE",null,null,null,{"$f":"IF(UPPER(E181)=\"REQUERIDO\", 10, \"\")","v":10},{"$f":"IF(UPPER(E181)=\"REQUERIDO\", H181, \"\")","v":0}]
["INSTALACIONES",{"$f":"B1","v":"Anx:"},{"$f":"C$1","v":"Requerido:"},"m² Util:","Tipo:","BUENO:","MALO:","Calif:","Observaciones:",null,null,null,null,null,null,null,null,null,null,null,null,null,null,null,null,null,null,null,null,null,{"$f":"SUM(O183:O184)","v":0},0,0,0,0,0,0,0,0,0,0,0,0,0,0,0]
["Estructura General ","DIA_EG_01",1,"-","Requerido",0,0,{"$f":"IF(AND(F183>=C183,F183>0),10,0)","v":0},null,null,"INSTALACIÓN"]
["Instalaciones Generales","DIA_IG_01",1,"-","Requerido",0,0,{"$f":"IF(AND(F184>=C184,F184>0),10,0)","v":0},null,null,"INSTALACIÓN"]
["VESTUARIOS GENERAL",null,null,null,null,null,null,null,null,null,null,null,null,null,null,null,null,null,null,null,null,null,null,null,null,null,null,null,null,null,{"$f":"SUM(O186:O193)","v":20},{"$f":"SUM(P186:P193)","v":0},0,0,{"$f":"SUM(S186:S193)","v":0},{"$f":"SUM(T186:T193)","v":0},0,{"$f":"SUM(V186:V193)","v":0},{"$f":"SUM(W186:W193)","v":0},0,{"$f":"SUM(Y186:Y193)","v":0},{"$f":"SUM(Z186:Z193)","v":0},0,{"$f":"SUM(AB186:AB193)","v":0},{"$f":"SUM(AC186:AC193)","v":0},0]
["ÁREA DE PERSONAL",null,null,null,null,null,null,null,null,null,null,null,null,null,null,null,null,null,null,null,null,null,null,null,null,null,null,null,null,null,{"$f":"SUM(O187:O193)","v":20},{"$f":"SUM(P187:P193)","v":0},0,0,{"$f":"SUM(S187:S193)","v":0},{"$f":"SUM(T187:T193)","v":0},0,{"$f":"SUM(V187:V193)","v":0},{"$f":"SUM(W187:W193)","v":0},0,{"$f":"SUM(Y187:Y193)","v":0},{"$f":"SUM(Z187:Z193)","v":0},0,{"$f":"SUM(AB187:AB193)","v":0},{"$f":"SUM(AC187:AC193)","v":0},0]
["AMBIENTES",{"$f":"B1","v":"Anx:"},{"$f":"C$1","v":"Requerido:"},"m² Util:","Tipo:","BUENO:","MALO:","Calif:","Observaciones:",null,null,null,null,null,null,null,null,null,null,null,null,null,null,null,null,null,null,null,null,null,{"$f":"SUM(O188:O190)","v":20},{"$f":"SUM(P188:P190)","v":0},0,0,{"$f":"SUM(S188:S190)","v":0},{"$f":"SUM(T188:T190)","v":0},0,{"$f":"SUM(V188:V190)","v":0},{"$f":"SUM(W188:W190)","v":0},0,{"$f":"SUM(Y188:Y190)","v":0},{"$f":"SUM(Z188:Z190)","v":0},0,{"$f":"SUM(AB188:AB190)","v":0},{"$f":"SUM(AC188:AC190)","v":0},0]
["Acceso",null,1,"-","Opcional",0,0,{"$f":"IF(AND(F188>=C188,F188>0),10,0)","v":0},null,null,"INSTALACIÓN"]
["Vestidor general femenino con baño",null,1,"-","Requerido",0,0,{"$f":"IF(AND(F189>=C189,F189>0),10,0)","v":0},null,null,"AMBIENTE",null,null,null,{"$f":"IF(UPPER(E189)=\"REQUERIDO\", 10, \"\")","v":10},{"$f":"IF(UPPER(E189)=\"REQUERIDO\", H189, \"\")","v":0}]
["Vestidor general masculino con baño",null,1,"-","Requerido",0,0,{"$f":"IF(AND(F190>=C190,F190>0),10,0)","v":0},null,null,"AMBIENTE",null,null,null,{"$f":"IF(UPPER(E190)=\"REQUERIDO\", 10, \"\")","v":10},{"$f":"IF(UPPER(E190)=\"REQUERIDO\", H190, \"\")","v":0}]
["INSTALACIONES",{"$f":"B1","v":"Anx:"},{"$f":"C$1","v":"Requerido:"},"m² Util:","Tipo:","BUENO:","MALO:","Calif:","Observaciones:",null,null,null,null,null,null,null,null,null,null,null,null,null,null,null,null,null,null,null,null,null,{"$f":"SUM(O192:O193)","v":0},0,0,0,0,0,0,0,0,0,0,0,0,0,0,0]
["Estructura General ","DIA_EG_01",1,"-","Requerido",0,0,{"$f":"IF(AND(F192>=C192,F192>0),10,0)","v":0},null,null,"INSTALACIÓN"]
["Instalaciones Generales","DIA_IG_01",1,"-","Requerido",0,0,{"$f":"IF(AND(F193>=C193,F193>0),10,0)","v":0},null,null,"INSTALACIÓN"]
["MANTENIMIENTO",null,null,null,null,null,null,null,null,null,null,null,null,null,null,null,null,null,null,null,null,null,null,null,null,null,null,null,null,null,{"$f":"SUM(O195:O200)","v":0},{"$f":"SUM(P195:P200)","v":0},{"$f":"SUM(Q195:Q200)","v":0},0,0,{"$f":"SUM(T195:T200)","v":0},10,0,{"$f":"SUM(W195:W200)","v":0},0,0,{"$f":"SUM(Z195:Z200)","v":0},0,0,{"$f":"SUM(AC195:AC200)","v":20},0]
["ÁREA TÉCNICA",null,null,null,null,null,null,null,null,null,null,null,null,null,null,null,null,null,null,null,null,null,null,null,null,null,null,null,null,null,{"$f":"SUM(O196:O200)","v":0},{"$f":"SUM(P196:P200)","v":0},{"$f":"SUM(Q196:Q200)","v":0},{"$f":"SUM(R196:R200)","v":0},0,0,10,0,0,0,0,0,0,0,20,0]
["AMBIENTES",{"$f":"B1","v":"Anx:"},{"$f":"C$1","v":"Requerido:"},"m² Util:","Tipo:","BUENO:","MALO:","Calif:","Observaciones:",null,null,null,null,null,null,null,null,null,null,null,null,null,null,null,null,null,null,null,null,null,{"$f":"SUM(U197:U197)","v":10},{"$f":"SUM(V197:V197)","v":0},{"$f":"SUM(Q197:Q197)","v":0},{"$f":"SUM(X197:X197)","v":0},0,{"$f":"SUM(T197:T197)","v":0},{"$f":"SUM(AA197:AA197)","v":0},0,{"$f":"SUM(W197:W197)","v":0},{"$f":"SUM(AD197:AD197)","v":0},0,{"$f":"SUM(Z197:Z197)","v":0},{"$f":"SUM(AG197:AG197)","v":0},0,{"$f":"SUM(AC197:AC197)","v":0},{"$f":"SUM(AJ197:AJ197)","v":0}]
["Taller",null,1,"-","Condición",0,0,{"$f":"IF(AND(F197>=C197,F197>0),10,0)","v":0},null,null,"AMBIENTE",null,null,null,null,null,null,null,null,null,{"$f":"IF(UPPER(E197)=\"CONDICIÓN\", 10, \"\")","v":10},{"$f":"IF(UPPER(E197)=\"CONDICIÓN\", H197, \"\")","v":0}]
["INSTALACIONES",{"$f":"B1","v":"Anx:"},{"$f":"C$1","v":"Requerido:"},"m² Util:","Tipo:","BUENO:","MALO:","Calif:","Observaciones:",null,null,null,null,null,null,null,null,null,null,null,null,null,null,null,null,null,null,null,null,null,{"$f":"SUM(O199:O200)","v":0},{"$f":"SUM(P199:P200)","v":0},{"$f":"SUM(Q199:Q200)","v":0},0,0,0,0,0,0,0,0,0,0,0,{"$f":"SUM(AC199:AC200)","v":20},{"$f":"SUM(AD199:AD200)","v":0}]
["Estructura General ","DIA_EG_01",1,"-","Condición",0,0,{"$f":"IF(AND(F199>=C199,F199>0),10,0)","v":0},null,null,"INSTALACIÓN",null,null,null,null,null,null,null,null,null,null,null,null,null,null,null,null,null,{"$f":"IF(UPPER(E199)=\"CONDICIÓN\", 10, \"\")","v":10},{"$f":"IF(UPPER(E199)=\"CONDICIÓN\", H199, \"\")","v":0}]
["Instalaciones Generales","DIA_IG_01",1,"-","Condición",0,0,{"$f":"IF(AND(F200>=C200,F200>0),10,0)","v":0},null,null,"INSTALACIÓN",null,null,null,null,null,null,null,null,null,null,null,null,null,null,null,null,null,{"$f":"IF(UPPER(E200)=\"CONDICIÓN\", 10, \"\")","v":10},{"$f":"IF(UPPER(E200)=\"CONDICIÓN\", H200, \"\")","v":0}]
["ALMACENAMIENTO FINAL DE DESECHOS",null,null,null,null,null,null,null,null,null,null,null,null,null,null,null,null,null,null,null,null,null,null,null,null,null,null,null,null,null,{"$f":"SUM(O202:O209)","v":30},{"$f":"SUM(P202:P209)","v":0},0,0,{"$f":"SUM(S202:S209)","v":0},{"$f":"SUM(T202:T209)","v":0},0,{"$f":"SUM(V202:V209)","v":0},{"$f":"SUM(W202:W209)","v":0},0,{"$f":"SUM(Y202:Y209)","v":0},{"$f":"SUM(Z202:Z209)","v":0},0,{"$f":"SUM(AB202:AB209)","v":0},{"$f":"SUM(AC202:AC209)","v":0},0]
["ÁREA TÉCNICA",null,null,null,null,null,null,null,null,null,null,null,null,null,null,null,null,null,null,null,null,null,null,null,null,null,null,null,null,null,{"$f":"SUM(O203:O209)","v":30},0,0,{"$f":"SUM(R203:R209)","v":0},{"$f":"SUM(S203:S209)","v":0},{"$f":"SUM(T203:T209)","v":0},{"$f":"SUM(U203:U209)","v":0},{"$f":"SUM(V203:V209)","v":0},{"$f":"SUM(W203:W209)","v":0},{"$f":"SUM(X203:X209)","v":0},{"$f":"SUM(Y203:Y209)","v":0},{"$f":"SUM(Z203:Z209)","v":0},{"$f":"SUM(AA203:AA209)","v":0},{"$f":"SUM(AB203:AB209)","v":0},{"$f":"SUM(AC203:AC209)","v":0},{"$f":"SUM(AD203:AD209)","v":0}]
["AMBIENTES",{"$f":"B1","v":"Anx:"},{"$f":"C$1","v":"Requerido:"},"m² Util:","Tipo:","BUENO:","MALO:","Calif:","Observaciones:",null,null,null,null,null,null,null,null,null,null,null,null,null,null,null,null,null,null,null,null,null,{"$f":"SUM(O204:O206)","v":30},0,0,{"$f":"SUM(R204:R206)","v":0},{"$f":"SUM(S204:S206)","v":0},{"$f":"SUM(T204:T206)","v":0},{"$f":"SUM(U204:U206)","v":0},{"$f":"SUM(V204:V206)","v":0},{"$f":"SUM(W204:W206)","v":0},{"$f":"SUM(X204:X206)","v":0},{"$f":"SUM(Y204:Y206)","v":0},{"$f":"SUM(Z204:Z206)","v":0},{"$f":"SUM(AA204:AA206)","v":0},{"$f":"SUM(AB204:AB206)","v":0},{"$f":"SUM(AC204:AC206)","v":0},{"$f":"SUM(AD204:AD206)","v":0}]
["Área de residuos generales-comunes",null,1,"-","Requerido",0,0,{"$f":"IF(AND(F204>=C204,F204>0),10,0)","v":0},null,null,"AMBIENTE",null,null,null,{"$f":"IF(UPPER(E204)=\"REQUERIDO\", 10, \"\")","v":10},{"$f":"IF(UPPER(E204)=\"REQUERIDO\", H204, \"\")","v":0}]
["Área de residuos peligrosos-infecciosos",null,1,"-","Requerido",0,0,{"$f":"IF(AND(F205>=C205,F205>0),10,0)","v":0},null,null,"AMBIENTE",null,null,null,{"$f":"IF(UPPER(E205)=\"REQUERIDO\", 10, \"\")","v":10},{"$f":"IF(UPPER(E205)=\"REQUERIDO\", H205, \"\")","v":0}]
["Área de residuos especiales",null,1,"-","Requerido",0,0,{"$f":"IF(AND(F206>=C206,F206>0),10,0)","v":0},null,null,"AMBIENTE",null,null,null,{"$f":"IF(UPPER(E206)=\"REQUERIDO\", 10, \"\")","v":10},{"$f":"IF(UPPER(E206)=\"REQUERIDO\", H206, \"\")","v":0}]
["INSTALACIONES",{"$f":"B1","v":"Anx:"},{"$f":"C$1","v":"Requerido:"},"m² Util:","Tipo:","BUENO:","MALO:","Calif:","Observaciones:",null,null,null,null,null,null,null,null,null,null,null,null,null,null,null,null,null,null,null,null,null,{"$f":"SUM(O208:O209)","v":0},0,0,0,0,0,0,0,0,0,0,0,0,0,0,0]
["Estructura General ","DIA_EG_01",1,"-","Requerido",0,0,{"$f":"IF(AND(F208>=C208,F208>0),10,0)","v":0},null,null,"INSTALACIÓN"]
["Instalaciones Generales","DIA_IG_01",1,"-","Requerido",0,0,{"$f":"IF(AND(F209>=C209,F209>0),10,0)","v":0},null,null,"INSTALACIÓN"]
["INSTALACIONES DEL LOCAL",null,null,null,null,null,null,null,null,null,"INSTALACIÓN",null,null,null,null,null,null,null,null,null,null,null,null,null,null,null,null,null,null,null,{"$f":"SUM(O211:O231)","v":0},{"$f":"SUM(P211:P231)","v":0},{"$f":"SUM(Q211:Q231)","v":0},{"$f":"SUM(R211:R231)","v":0},0,0,0,0,190,{"$f":"SUM(X211:X231)","v":0},0,0,10,0,10,0]
["Acometidas eléctricas",null,1,"-","Requerido",0,0,{"$f":"IF(AND(F211>=C211,F211>0),10,0)","v":0},null,null,"INSTALACIÓN",null,null,null,null,null,null,null,null,null,null,null,{"$f":"IF(UPPER(E211)=\"REQUERIDO\", 10, \"\")","v":10},{"$f":"IF(UPPER(E211)=\"REQUERIDO\", H211, \"\")","v":0}]
["Acometidas hidráulicas",null,1,"-","Requerido",0,0,0,null,null,"INSTALACIÓN",null,null,null,null,null,null,null,null,null,null,null,10,0]
["Alarmas de seguridad",null,1,"-","Requerido",0,0,0,null,null,"INSTALACIÓN",null,null,null,null,null,null,null,null,null,null,null,10,0]
["Canales de agua lluvia",null,1,"-","Requerido",0,0,0,null,null,"INSTALACIÓN",null,null,null,null,null,null,null,null,null,null,null,10,0]
["Cisterna de agua potable",null,1,"-","Requerido",0,0,0,null,null,"INSTALACIÓN",null,null,null,null,null,null,null,null,null,null,null,10,0]
["Estructura general","DIA_EG_01",1,"-","Requerido",0,0,0,null,null,"INSTALACIÓN",null,null,null,null,null,null,null,null,null,null,null,10,0]
["Sistema de prevención de incendios - Extintores ",null,1,"-","Requerido",0,0,0,null,null,"INSTALACIÓN",null,null,null,null,null,null,null,null,null,null,null,10,0]
["Generador eléctrico",null,1,"-","Requerido",0,0,0,null,null,"INSTALACIÓN",null,null,null,null,null,null,null,null,null,null,null,10,0]
["Hidrantes anti-incendios",null,1,"-","Requerido",0,0,0,null,null,"INSTALACIÓN",null,null,null,null,null,null,null,null,null,null,null,10,0]
["Instalaciones de agua caliente",null,1,"-","Requerido",0,0,0,null,null,"INSTALACIÓN",null,null,null,null,null,null,null,null,null,null,null,10,0]
["Instalaciones de alcantarillado",null,1,"-","Requerido",0,0,0,null,null,"INSTALACIÓN",null,null,null,null,null,null,null,null,null,null,null,10,0]
["Instalaciones de ascensores (Se hará requerido en el caso de que  el establecimiento  de salud desarrolladas en altura y que tengan procedimiento o área de tratamiento  desde la edificación de  dos plantas arquitectónicas y  se deberá contemplar como mínimo un montacamillas, o como alternativa el diseño de una rampa).",null,1,"-","Condición",0,0,0,null,null,"INSTALACIÓN",null,null,null,null,null,null,null,null,null,null,null,null,null,null,null,null,null,{"$f":"IF(UPPER(E222)=\"CONDICIÓN\", 10, 0)","v":10},{"$f":"IF(UPPER(E222)=\"CONDICIÓN\", H222, \"\")","v":0}]
["Instalaciones de gases medicinales- oxígeno- red centralizada (Se hará requerido en el caso de contar con la sala de procedimientos)",null,1,"-","Requerido",0,0,0,null,null,"INSTALACIÓN",null,null,null,null,null,null,null,null,null,null,null,{"$f":"IF(UPPER(E223)=\"REQUERIDO\", 10, \"\")","v":10},{"$f":"IF(UPPER(E223)=\"REQUERIDO\", H223, \"\")","v":0}]
["Instalaciones de pararrayos",null,1,"-","Requerido",0,0,0,null,null,"INSTALACIÓN",null,null,null,null,null,null,null,null,null,null,null,{"$f":"IF(UPPER(E224)=\"REQUERIDO\", 10, \"\")","v":10},{"$f":"IF(UPPER(E224)=\"REQUERIDO\", H224, \"\")","v":0}]
["Instalaciones de vacío",null,1,"-","Requerido",0,0,0,null,null,"INSTALACIÓN",null,null,null,null,null,null,null,null,null,null,null,{"$f":"IF(UPPER(E225)=\"REQUERIDO\", 10, \"\")","v":10},{"$f":"IF(UPPER(E225)=\"REQUERIDO\", H225, \"\")","v":0}]
["Instalaciones generales ","DIA_IG_01",1,"-","Requerido",0,0,0,null,null,"INSTALACIÓN",null,null,null,null,null,null,null,null,null,null,null,{"$f":"IF(UPPER(E226)=\"REQUERIDO\", 10, \"\")","v":10},{"$f":"IF(UPPER(E226)=\"REQUERIDO\", H226, \"\")","v":0}]
["Instalaciones telefónicas e Internet estructurado doble cableado ",null,1,"-","Requerido",0,0,0,null,null,"INSTALACIÓN",null,null,null,null,null,null,null,null,null,null,null,{"$f":"IF(UPPER(E227)=\"REQUERIDO\", 10, \"\")","v":10},{"$f":"IF(UPPER(E227)=\"REQUERIDO\", H227, \"\")","v":0}]
["Sensores de humos",null,1,"-","Deseable",0,0,0,null,null,"INSTALACIÓN",null,null,null,null,null,null,null,null,null,null,null,null,null,null,null,{"$f":"IF(UPPER(E228)=\"DESEABLE\", 10, 0)","v":10},{"$f":"IF(UPPER(E228)=\"DESEABLE\", H228, \"\")","v":0}]
["Señalización interna e externa (De aspecto Uniforme)",null,1,"-","Requerido",0,0,0,null,null,"INSTALACIÓN",null,null,null,null,null,null,null,null,null,null,null,{"$f":"IF(UPPER(E229)=\"REQUERIDO\", 10, \"\")","v":10},{"$f":"IF(UPPER(E229)=\"REQUERIDO\", H229, \"\")","v":0}]
["Áreas de Tránsito para atención de pacientes con suficiente amplitud para permitir el paso de pacientes con capacidades especiales y camillas",null,1,"-","Requerido",0,0,0,null,null,"INSTALACIÓN",null,null,null,null,null,null,null,null,null,null,null,{"$f":"IF(UPPER(E230)=\"REQUERIDO\", 10, \"\")","v":10},{"$f":"IF(UPPER(E230)=\"REQUERIDO\", H230, \"\")","v":0}]
["Instalaciones de Parqueamiento Vehicular, Ambulancias, Personal, Pacientes, y Discapacidades",null,1,"-","Requerido",0,0,0,null,null,null,null,null,null,null,null,null,null,null,null,null,null,{"$f":"IF(UPPER(E231)=\"REQUERIDO\", 10, \"\")","v":10},0]
["TOTALES PARCIALES:",null,null,null,null,null,null,null,null,null,null,null,null,null,null,null,null,null,null,null,null,null,"TOTAL GENERAL:",null,null,null,null,null,null,null,{"$f":"(+Infraestructura!$AE$4+Infraestructura!$AE$24+Infraestructura!$AE$49+Infraestructura!$AE$65+Infraestructura!$AE$83+Infraestructura!$AE$132+Infraestructura!$AE$163+Infraestructura!$AE$210)","v":330},{"$f":"(+Infraestructura!$AF$4+Infraestructura!$AF$24+Infraestructura!$AF$49+Infraestructura!$AF$65+Infraestructura!$AF$83+Infraestructura!$AF$132+Infraestructura!$AF$163+Infraestructura!$AF$210)","v":0},{"$f":"(+Infraestructura!$AG$4+Infraestructura!$AG$24+Infraestructura!$AG$49+Infraestructura!$AG$65+Infraestructura!$AG$83+Infraestructura!$AG$132+Infraestructura!$AG$163+Infraestructura!$AG$210)","v":20},{"$f":"(+Infraestructura!$AH$4+Infraestructura!$AH$24+Infraestructura!$AH$49+Infraestructura!$AH$65+Infraestructura!$AH$83+Infraestructura!$AH$132+Infraestructura!$AH$163+Infraestructura!$AH$210)","v":0},{"$f":"(+Infraestructura!$AI$4+Infraestructura!$AI$24+Infraestructura!$AI$49+Infraestructura!$AI$65+Infraestructura!$AI$83+Infraestructura!$AI$132+Infraestructura!$AI$163+Infraestructura!$AI$210)","v":20},{"$f":"(+Infraestructura!$AJ$4+Infraestructura!$AJ$24+Infraestructura!$AJ$49+Infraestructura!$AJ$65+Infraestructura!$AJ$83+Infraestructura!$AJ$132+Infraestructura!$AJ$163+Infraestructura!$AJ$210)","v":0},{"$f":"(+Infraestructura!$AK$4+Infraestructura!$AK$24+Infraestructura!$AK$49+Infraestructura!$AK$65+Infraestructura!$AK$83+Infraestructura!$AK$132+Infraestructura!$AK$163+Infraestructura!$AK$210)","v":190},{"$f":"(+Infraestructura!$AL$4+Infraestructura!$AL$24+Infraestructura!$AL$49+Infraestructura!$AL$65+Infraestructura!$AL$83+Infraestructura!$AL$132+Infraestructura!$AL$163+Infraestructura!$AL$210)","v":0},{"$f":"(+Infraestructura!$AM$4+Infraestructura!$AM$24+Infraestructura!$AM$49+Infraestructura!$AM$65+Infraestructura!$AM$83+Infraestructura!$AM$132+Infraestructura!$AM$163+Infraestructura!$AM$210)","v":190},{"$f":"(+Infraestructura!$AN$4+Infraestructura!$AN$24+Infraestructura!$AN$49+Infraestructura!$AN$65+Infraestructura!$AN$83+Infraestructura!$AN$132+Infraestructura!$AN$163+Infraestructura!$AN$210)","v":0},{"$f":"(+Infraestructura!$AO$4+Infraestructura!$AO$24+Infraestructura!$AO$49+Infraestructura!$AO$65+Infraestructura!$AO$83+Infraestructura!$AO$132+Infraestructura!$AO$163+Infraestructura!$AO$210)","v":0},{"$f":"(+Infraestructura!$AP$4+Infraestructura!$AP$24+Infraestructura!$AP$49+Infraestructura!$AP$65+Infraestructura!$AP$83+Infraestructura!$AP$132+Infraestructura!$AP$163+Infraestructura!$AP$210)","v":0},{"$f":"(+Infraestructura!$AQ$4+Infraestructura!$AQ$24+Infraestructura!$AQ$49+Infraestructura!$AQ$65+Infraestructura!$AQ$83+Infraestructura!$AQ$132+Infraestructura!$AQ$163+Infraestructura!$AQ$210)","v":10},{"$f":"(+Infraestructura!$AR$4+Infraestructura!$AR$24+Infraestructura!$AR$49+Infraestructura!$AR$65+Infraestructura!$AR$83+Infraestructura!$AR$132+Infraestructura!$AR$163+Infraestructura!$AR$210)","v":0},{"$f":"(+Infraestructura!$AS$4+Infraestructura!$AS$24+Infraestructura!$AS$49+Infraestructura!$AS$65+Infraestructura!$AS$83+Infraestructura!$AS$132+Infraestructura!$AS$163+Infraestructura!$AS$210)","v":30},{"$f":"(+Infraestructura!$AT$4+Infraestructura!$AT$24+Infraestructura!$AT$49+Infraestructura!$AT$65+Infraestructura!$AT$83+Infraestructura!$AT$132+Infraestructura!$AT$163+Infraestructura!$AT$210)","v":0}]
["AMBIENTES:",null,"% Obtenido:","% Obtenido:","% Obtenido:","% A Cumplir:","% Final:",null,null,null,null,null,null,null,null,null,null,null,null,null,null,1,"SERVICIO DE ADMISIÓN Y CONSULTA EXTERNA",null,null,null,"SERVICIO DE ADMISIÓN Y CONSULTA EXTERNA",null,null,null,{"$f":"AE4*100/AE232","v":21.212121212121211},{"$f":"AF4*100/AE232","v":0},{"$f":"AG4*100/AG232","v":0},{"$f":"AH4*100/AG232","v":0},{"$f":"AI4*100/AI232","v":0},{"$f":"AJ4*100/AI232","v":0},{"$f":"AK4*100/AK232","v":5.2631578947368425},{"$f":"AL4*100/AK232","v":0},{"$f":"AM4*100/AM232","v":0},{"$f":"AN4*100/AM232","v":0},{"$f":"AO4*100/AO232","v":{"$error":"#DIV/0!"}},{"$f":"AP4*100/AO232","v":{"$error":"#DIV/0!"}},{"$f":"AQ4*100/AQ232","v":0},{"$f":"AR4*100/AQ232","v":0},{"$f":"AS4*100/AS232","v":0},{"$f":"AT4*100/AS232","v":0}]
[{"$f":"Infraestructura!$W$233","v":"SERVICIO DE ADMISIÓN Y CONSULTA EXTERNA"},null,{"$f":"Infraestructura!$AF$233*50/100/100","v":0},null,null,{"$f":"Infraestructura!$AE$233*50/100/100","v":0.10606060606060605},{"$f":"IF(Infraestructura!$C$234=Infraestructura!$F$234, \"CUMPLE\", \"NO CUMPLE\")","v":"NO CUMPLE"},null,null,null,null,null,null,null,null,null,null,null,null,null,null,2,"CONSULTA EXTERNA",null,null,null,"CONSULTA EXTERNA",null,null,null,{"$f":"AE5*100/AE232","v":21.212121212121211},{"$f":"AF5*100/AE232","v":0},{"$f":"AG5*100/AG232","v":0},{"$f":"AH5*100/AG232","v":0},{"$f":"AI5*100/AI232","v":0},{"$f":"AJ5*100/AI232","v":0},{"$f":"AK5*100/AK232","v":5.2631578947368425},{"$f":"AL5*100/AK232","v":0},{"$f":"AM5*100/AM232","v":0},{"$f":"AN5*100/AM232","v":0},{"$f":"AO5*100/AO232","v":{"$error":"#DIV/0!"}},{"$f":"AP5*100/AO232","v":{"$error":"#DIV/0!"}},{"$f":"AQ5*100/AQ232","v":0},{"$f":"AR5*100/AQ232","v":0},{"$f":"AS5*100/AS232","v":0},{"$f":"AT5*100/AS232","v":0}]
[{"$f":"Infraestructura!$W$234","v":"CONSULTA EXTERNA"},null,null,{"$f":"Infraestructura!$AF$234*50/100/100","v":0},null,{"$f":"Infraestructura!$AE$234*50/100/100","v":0.10606060606060605},{"$f":"IF(Infraestructura!$D$235=Infraestructura!$F$235, \"CUMPLE\", \"NO CUMPLE\")","v":"NO CUMPLE"},null,null,null,null,null,null,null,null,null,null,null,null,null,null,3,"ADMISIÓN Y CONTROL",null,null,null,"ADMISIÓN Y CONTROL",null,null,null,{"$f":"AE6*100/AE232","v":9.0909090909090917},{"$f":"AF6*100/AE232","v":0},{"$f":"AG6*100/AG232","v":0},{"$f":"AH6*100/AG232","v":0},{"$f":"AI6*100/AI232","v":0},{"$f":"AJ6*100/AI232","v":0},{"$f":"AK6*100/AK232","v":0},{"$f":"AL6*100/AK232","v":0},{"$f":"AM6*100/AM232","v":0},{"$f":"AN6*100/AM232","v":0},{"$f":"AO6*100/AO232","v":{"$error":"#DIV/0!"}},{"$f":"AP6*100/AO232","v":{"$error":"#DIV/0!"}},{"$f":"AQ6*100/AQ232","v":0},{"$f":"AR6*100/AQ232","v":0},{"$f":"AS6*100/AS232","v":0},{"$f":"AT6*100/AS232","v":0}]
[{"$f":"Infraestructura!$W$235","v":"ADMISIÓN Y CONTROL"},null,null,null,{"$f":"Infraestructura!$AF$235*50/100/100","v":0},{"$f":"Infraestructura!$AE$235*50/100/100","v":4.5454545454545456E-2},{"$f":"IF(Infraestructura!$E$236=Infraestructura!$F$236, \"CUMPLE\", \"NO CUMPLE\")","v":"NO CUMPLE"},null,null,null,null,null,null,null,null,null,null,null,null,null,null,4,"AREA DE PACIENTE",null,null,null,"AREA DE PACIENTE",null,null,null,{"$f":"AE14*100/AE232","v":12.121212121212121},{"$f":"AF14*100/AE232","v":0},{"$f":"AG14*100/AG232","v":0},{"$f":"AH14*100/AG232","v":0},{"$f":"AI14*100/AI232","v":0},{"$f":"AJ14*100/AI232","v":0},{"$f":"AK14*100/AK232","v":5.2631578947368425},{"$f":"AL14*100/AK232","v":0},{"$f":"AM14*100/AM232","v":0},{"$f":"AN14*100/AM232","v":0},{"$f":"AO14*100/AO232","v":{"$error":"#DIV/0!"}},{"$f":"AP14*100/AO232","v":{"$error":"#DIV/0!"}},{"$f":"AQ14*100/AQ232","v":0},{"$f":"AR14*100/AQ232","v":0},{"$f":"AS14*100/AS232","v":0},{"$f":"AT14*100/AS232","v":0}]
[{"$f":"Infraestructura!$W$236","v":"AREA DE PACIENTE"},null,null,null,{"$f":"Infraestructura!$AF$236*50/100/100","v":0},{"$f":"Infraestructura!$AE$236*50/100/100","v":6.0606060606060594E-2},{"$f":"IF(Infraestructura!$E$237=Infraestructura!$F$237, \"CUMPLE\", \"NO CUMPLE\")","v":"NO CUMPLE"},null,null,null,null,null,null,null,null,null,null,null,null,null,null,5,"SERVICIO DE DIÁLISIS PERITONEAL",null,null,null,"SERVICIO DE HEMODIÁLISIS",null,null,null,{"$f":"AE24*100/AE232","v":12.121212121212121},{"$f":"AF24*100/AE232","v":0},{"$f":"AG24*100/AG232","v":0},{"$f":"AH24*100/AG232","v":0},{"$f":"AI24*100/AI232","v":0},{"$f":"AJ24*100/AI232","v":0},{"$f":"AK24*100/AK232","v":15.789473684210526},{"$f":"AL24*100/AK232","v":0},{"$f":"AM24*100/AM232","v":0},{"$f":"AN24*100/AM232","v":0},{"$f":"AO24*100/AO232","v":{"$error":"#DIV/0!"}},{"$f":"AP24*100/AO232","v":{"$error":"#DIV/0!"}},{"$f":"AQ24*100/AQ232","v":0},{"$f":"AR24*100/AQ232","v":0},{"$f":"AS24*100/AS232","v":0},{"$f":"AT24*100/AS232","v":0}]
[{"$f":"Infraestructura!$W$237","v":"SERVICIO DE DIÁLISIS PERITONEAL"},null,{"$f":"Infraestructura!$AF$237*50/100/100","v":0},null,null,{"$f":"Infraestructura!$AE$237*50/100/100","v":6.0606060606060594E-2},{"$f":"IF(Infraestructura!$C$238=Infraestructura!$F$238, \"CUMPLE\", \"NO CUMPLE\")","v":"NO CUMPLE"},null,null,null,null,null,null,null,null,null,null,null,null,null,null,6,"ÁREA DE PROCEDIMIENTO  DE DIÁLISIS PERITONEAL",null,null,null,"ÁREA DE PROCEDIMIENTO  DE HEMODIÁLISIS",null,null,null,{"$f":"AE25*100/AE232","v":0},{"$f":"AF25*100/AE232","v":0},{"$f":"AG25*100/AG232","v":0},{"$f":"AH25*100/AG232","v":0},{"$f":"AI25*100/AI232","v":0},{"$f":"AJ25*100/AI232","v":0},{"$f":"AK25*100/AK232","v":10.526315789473685},{"$f":"AL25*100/AK232","v":0},{"$f":"AM25*100/AM232","v":0},{"$f":"AN25*100/AM232","v":0},{"$f":"AO25*100/AO232","v":{"$error":"#DIV/0!"}},{"$f":"AP25*100/AO232","v":{"$error":"#DIV/0!"}},{"$f":"AQ25*100/AQ232","v":0},{"$f":"AR25*100/AQ232","v":0},{"$f":"AS25*100/AS232","v":0},{"$f":"AT25*100/AS232","v":0}]
[{"$f":"Infraestructura!$W$238","v":"ÁREA DE PROCEDIMIENTO  DE DIÁLISIS PERITONEAL"},null,null,{"$f":"Infraestructura!$AF$238*50/100/100","v":0},null,{"$f":"Infraestructura!$AE$238*50/100/100","v":0},{"$f":"IF(Infraestructura!$D$239=Infraestructura!$F$239, \"CUMPLE\", \"NO CUMPLE\")","v":"CUMPLE"},null,null,null,null,null,null,null,null,null,null,null,null,null,null,7,"ÁREA DE TRATAMIENTO",null,null,null,"ÁREA DE TRATAMIENTO",null,null,null,{"$f":"AE26*100/AE232","v":0},{"$f":"AF26*100/AE232","v":0},{"$f":"AG26*100/AG232","v":0},{"$f":"AH26*100/AG232","v":0},{"$f":"AI26*100/AI232","v":0},{"$f":"AJ26*100/AI232","v":0},{"$f":"AK26*100/AK232","v":10.526315789473685},{"$f":"AL26*100/AK232","v":0},{"$f":"AM26*100/AM232","v":0},{"$f":"AN26*100/AM232","v":0},{"$f":"AO26*100/AO232","v":{"$error":"#DIV/0!"}},{"$f":"AP26*100/AO232","v":{"$error":"#DIV/0!"}},{"$f":"AQ26*100/AQ232","v":0},{"$f":"AR26*100/AQ232","v":0},{"$f":"AS26*100/AS232","v":0},{"$f":"AT26*100/AS232","v":0}]
[{"$f":"Infraestructura!$W$239","v":"ÁREA DE TRATAMIENTO"},null,null,null,{"$f":"Infraestructura!$AF$239*50/100/100","v":0},{"$f":"Infraestructura!$AE$239*50/100/100","v":0},{"$f":"IF(Infraestructura!$E$240=Infraestructura!$F$240, \"CUMPLE\", \"NO CUMPLE\")","v":"CUMPLE"},null,null,null,null,null,null,null,null,null,null,null,null,null,null,8,"ÁREA DE APOYO Y APROVISONAMIENTO",null,null,null,"ÁREA DE APOYO Y APROVISONAMIENTO",null,null,null,{"$f":"AE33*100/AE232","v":12.121212121212121},{"$f":"AF33*100/AE232","v":0},{"$f":"AG33*100/AG232","v":0},{"$f":"AH33*100/AG232","v":0},{"$f":"AI33*100/AI232","v":0},{"$f":"AJ33*100/AI232","v":0},{"$f":"AK33*100/AK232","v":5.2631578947368425},{"$f":"AL33*100/AK232","v":0},{"$f":"AM33*100/AM232","v":0},{"$f":"AN33*100/AM232","v":0},{"$f":"AO33*100/AO232","v":{"$error":"#DIV/0!"}},{"$f":"AP33*100/AO232","v":{"$error":"#DIV/0!"}},{"$f":"AQ33*100/AQ232","v":0},{"$f":"AR33*100/AQ232","v":0},{"$f":"AS33*100/AS232","v":0},{"$f":"AT33*100/AS232","v":0}]
[{"$f":"Infraestructura!$W$240","v":"ÁREA DE APOYO Y APROVISONAMIENTO"},null,null,{"$f":"Infraestructura!$AF$240*50/100/100","v":0},null,{"$f":"Infraestructura!$AE$240*50/100/100","v":6.0606060606060594E-2},{"$f":"IF(Infraestructura!$D$241=Infraestructura!$F$241, \"CUMPLE\", \"NO CUMPLE\")","v":"NO CUMPLE"},null,null,null,null,null,null,null,null,null,null,null,null,null,null,9,"ÁREA PACIENTE",null,null,null,"ÁREA PACIENTE",null,null,null,{"$f":"AE34*100/AE232","v":6.0606060606060606},{"$f":"AF34*100/AE232","v":0},{"$f":"AG34*100/AG232","v":0},{"$f":"AH34*100/AG232","v":0},{"$f":"AI34*100/AI232","v":0},{"$f":"AJ34*100/AI232","v":0},{"$f":"AK34*100/AK232","v":5.2631578947368425},{"$f":"AL34*100/AK232","v":0},{"$f":"AM34*100/AM232","v":0},{"$f":"AN34*100/AM232","v":0},{"$f":"AO34*100/AO232","v":{"$error":"#DIV/0!"}},{"$f":"AP34*100/AO232","v":{"$error":"#DIV/0!"}},{"$f":"AQ34*100/AQ232","v":0},{"$f":"AR34*100/AQ232","v":0},{"$f":"AS34*100/AS232","v":0},{"$f":"AT34*100/AS232","v":0}]
[{"$f":"Infraestructura!$W$241","v":"ÁREA PACIENTE"},null,null,null,{"$f":"Infraestructura!$AF$241*50/100/100","v":0},{"$f":"Infraestructura!$AE$241*50/100/100","v":3.0303030303030297E-2},{"$f":"IF(Infraestructura!$E$242=Infraestructura!$F$242, \"CUMPLE\", \"NO CUMPLE\")","v":"NO CUMPLE"},null,null,null,null,null,null,null,null,null,null,null,null,null,null,10,"SERVICIO DE DIÁLISIS PERITONEAL",null,null,null,"SERVICIO DE DIÁLISIS PERITONEAL",null,null,null,{"$f":"AE49*100/AE232","v":12.121212121212121},{"$f":"AF49*100/AE232","v":0},{"$f":"AG49*100/AG232","v":0},{"$f":"AH49*100/AG232","v":0},{"$f":"AI49*100/AI232","v":0},{"$f":"AJ49*100/AI232","v":0},{"$f":"AK49*100/AK232","v":0},{"$f":"AL49*100/AK232","v":0},{"$f":"AM49*100/AM232","v":0},{"$f":"AN49*100/AM232","v":0},{"$f":"AO49*100/AO232","v":{"$error":"#DIV/0!"}},{"$f":"AP49*100/AO232","v":{"$error":"#DIV/0!"}},{"$f":"AQ49*100/AQ232","v":0},{"$f":"AR49*100/AQ232","v":0},{"$f":"AS49*100/AS232","v":0},{"$f":"AT49*100/AS232","v":0}]
[{"$f":"Infraestructura!$W$242","v":"SERVICIO DE DIÁLISIS PERITONEAL"},null,{"$f":"Infraestructura!$AF$242*50/100/100","v":0},null,null,{"$f":"Infraestructura!$AE$242*50/100/100","v":6.0606060606060594E-2},{"$f":"IF(Infraestructura!$C$243=Infraestructura!$F$243, \"CUMPLE\", \"NO CUMPLE\")","v":"NO CUMPLE"},null,null,null,null,null,null,null,null,null,null,null,null,null,null,11,"ÁREA DE TRATAMIENTO DE DIÁLISIS PERITONEAL",null,null,null,"ÁREA DE TRATAMIENTO DE DIÁLISIS PERITONEAL",null,null,null,{"$f":"AE50*100/AE232","v":12.121212121212121},{"$f":"AF50*100/AE232","v":0},{"$f":"AG50*100/AG232","v":0},{"$f":"AH50*100/AG232","v":0},{"$f":"AI50*100/AI232","v":0},{"$f":"AJ50*100/AI232","v":0},{"$f":"AK50*100/AK232","v":0},{"$f":"AL50*100/AK232","v":0},{"$f":"AM50*100/AM232","v":0},{"$f":"AN50*100/AM232","v":0},{"$f":"AO50*100/AO232","v":{"$error":"#DIV/0!"}},{"$f":"AP50*100/AO232","v":{"$error":"#DIV/0!"}},{"$f":"AQ50*100/AQ232","v":0},{"$f":"AR50*100/AQ232","v":0},{"$f":"AS50*100/AS232","v":0},{"$f":"AT50*100/AS232","v":0}]
[{"$f":"Infraestructura!$W$243","v":"ÁREA DE TRATAMIENTO DE DIÁLISIS PERITONEAL"},null,null,{"$f":"Infraestructura!$AF$243*50/100/100","v":0},null,{"$f":"Infraestructura!$AE$243*50/100/100","v":6.0606060606060594E-2},{"$f":"IF(Infraestructura!$D$244=Infraestructura!$F$244, \"CUMPLE\", \"NO CUMPLE\")","v":"NO CUMPLE"},null,null,null,null,null,null,null,null,null,null,null,null,null,null,12,"ÁREA DE TRATAMIENTO ",null,null,null,"ÁREA DE TRATAMIENTO ",null,null,null,{"$f":"AE51*100/AE232","v":6.0606060606060606},{"$f":"AF51*100/AE232","v":0},{"$f":"AG51*100/AG232","v":0},{"$f":"AH51*100/AG232","v":0},{"$f":"AH51*100/AI232","v":0},{"$f":"AH51*100/AI232","v":0},{"$f":"AK51*100/AK232","v":0},{"$f":"AL51*100/AK232","v":0},{"$f":"AM51*100/AM232","v":0},{"$f":"AN51*100/AM232","v":0},{"$f":"AN51*100/AO232","v":{"$error":"#DIV/0!"}},{"$f":"AN51*100/AO232","v":{"$error":"#DIV/0!"}},{"$f":"AQ51*100/AQ232","v":0},{"$f":"AR51*100/AQ232","v":0},{"$f":"AS51*100/AS232","v":0},{"$f":"AT51*100/AS232","v":0}]
[{"$f":"Infraestructura!$W$244","v":"ÁREA DE TRATAMIENTO "},null,null,null,{"$f":"Infraestructura!$AF$244*50/100/100","v":0},{"$f":"Infraestructura!$AE$244*50/100/100","v":3.0303030303030297E-2},{"$f":"IF(Infraestructura!$E$245=Infraestructura!$F$245, \"CUMPLE\", \"NO CUMPLE\")","v":"NO CUMPLE"},null,null,null,null,null,null,null,null,null,null,null,null,null,null,13,"ÁREA TÉCNICA",null,null,null,"ÁREA TÉCNICA",null,null,null,{"$f":"AE58*100/AE232","v":6.0606060606060606},{"$f":"AF58*100/AE232","v":0},{"$f":"AG58*100/AG232","v":0},{"$f":"AH58*100/AG232","v":0},{"$f":"AI58*100/AI232","v":0},{"$f":"AJ58*100/AI232","v":0},{"$f":"AK58*100/AK232","v":0},{"$f":"AL58*100/AK232","v":0},{"$f":"AM58*100/AM232","v":0},{"$f":"AN58*100/AM232","v":0},{"$f":"AO58*100/AO232","v":{"$error":"#DIV/0!"}},{"$f":"AP58*100/AO232","v":{"$error":"#DIV/0!"}},{"$f":"AQ58*100/AQ232","v":0},{"$f":"AR58*100/AQ232","v":0},{"$f":"AS58*100/AS232","v":0},{"$f":"AT58*100/AS232","v":0}]
[{"$f":"W245","v":"ÁREA TÉCNICA"},null,null,null,{"$f":"Infraestructura!$AF$245*50/100/100","v":0},{"$f":"Infraestructura!$AE$245*50/100/100","v":3.0303030303030297E-2},{"$f":"IF(Infraestructura!$E$246=Infraestructura!$F$246, \"CUMPLE\", \"NO CUMPLE\")","v":"NO CUMPLE"},null,null,null,null,null,null,null,null,null,null,null,null,null,null,14,"SERVICIO DE DIAGNÓSTICO",null,null,null,"SERVICIO DE DIAGNÓSTICO",null,null,null,{"$f":"AE65*100/AE232","v":0},{"$f":"AF65*100/AE232","v":0},{"$f":"AG65*100/AG232","v":0},{"$f":"AH65*100/AG232","v":0},{"$f":"AI65*100/AI232","v":0},{"$f":"AJ65*100/AI232","v":0},{"$f":"AK65*100/AK232","v":26.315789473684209},{"$f":"AL65*100/AK232","v":0},{"$f":"AM65*100/AM232","v":0},{"$f":"AN65*100/AM232","v":0},{"$f":"AO65*100/AO232","v":{"$error":"#DIV/0!"}},{"$f":"AP65*100/AO232","v":{"$error":"#DIV/0!"}},{"$f":"AQ65*100/AQ232","v":0},{"$f":"AR65*100/AQ232","v":0},{"$f":"AS65*100/AS232","v":0},{"$f":"AT65*100/AS232","v":0}]
[{"$f":"Infraestructura!$W$250","v":"SERVICIOS DE APOYO"},null,{"$f":"Infraestructura!$AF$250*50/100/100","v":0},null,null,{"$f":"Infraestructura!$AE$250*50/100/100","v":0.10606060606060605},{"$f":"IF(Infraestructura!$C$247=Infraestructura!$F$247, \"CUMPLE\", \"NO CUMPLE\")","v":"NO CUMPLE"},null,null,null,null,null,null,null,null,null,null,null,null,null,null,15,"LABORATORIO - PUESTO DE TOMA DE MUESTRAS",null,null,null,"LABORATORIO - PUESTO DE TOMA DE MUESTRAS",null,null,null,{"$f":"AE66*100/AE232","v":0},{"$f":"AF66*100/AE232","v":0},{"$f":"AG66*100/AG232","v":0},{"$f":"AH66*100/AG232","v":0},{"$f":"AI66*100/AI232","v":0},{"$f":"AJ66*100/AI232","v":0},{"$f":"AK66*100/AK232","v":26.315789473684209},{"$f":"AL66*100/AK232","v":0},{"$f":"AM66*100/AM232","v":0},{"$f":"AN66*100/AM232","v":0},{"$f":"AO66*100/AO232","v":{"$error":"#DIV/0!"}},{"$f":"AP66*100/AO232","v":{"$error":"#DIV/0!"}},{"$f":"AQ66*100/AQ232","v":0},{"$f":"AR66*100/AQ232","v":0},{"$f":"AS66*100/AS232","v":0},{"$f":"AT66*100/AS232","v":0}]
[{"$f":"Infraestructura!$W$251","v":"FARMACIA"},null,null,{"$f":"Infraestructura!$AF$251*50/100/100","v":0},null,{"$f":"Infraestructura!$AE$251*50/100/100","v":7.575757575757576E-2},{"$f":"IF(Infraestructura!$D$248=Infraestructura!$F$248, \"CUMPLE\", \"NO CUMPLE\")","v":"NO CUMPLE"},null,null,null,null,null,null,null,null,null,null,null,null,null,null,16,"ÁREA DE TOMA DE MUESTRAS",null,null,null,"ÁREA DE TOMA DE MUESTRAS",null,null,null,{"$f":"AE68*100/AE232","v":0},{"$f":"AF68*100/AE232","v":0},{"$f":"AG68*100/AG232","v":0},{"$f":"AH68*100/AG232","v":0},{"$f":"AI68*100/AI232","v":0},{"$f":"AJ68*100/AI232","v":0},{"$f":"AK68*100/AK232","v":21.05263157894737},{"$f":"AL68*100/AK232","v":0},{"$f":"AM68*100/AM232","v":0},{"$f":"AN68*100/AM232","v":0},{"$f":"AO68*100/AO232","v":{"$error":"#DIV/0!"}},{"$f":"AP68*100/AO232","v":{"$error":"#DIV/0!"}},{"$f":"AQ68*100/AQ232","v":0},{"$f":"AR68*100/AQ232","v":0},{"$f":"AS68*100/AS232","v":0},{"$f":"AT68*100/AS232","v":0}]
[{"$f":"Infraestructura!$W$252","v":"ÁREA ADMINISTRATIVA Y DE PERSONAL"},null,null,null,{"$f":"Infraestructura!$AF$252*50/100/100","v":0},{"$f":"Infraestructura!$AE$252*50/100/100","v":1.5151515151515148E-2},{"$f":"IF(Infraestructura!$E$249=Infraestructura!$F$249, \"CUMPLE\", \"NO CUMPLE\")","v":"NO CUMPLE"},null,null,null,null,null,null,null,null,null,null,null,null,null,null,17,"ÁREA DE PROCESAMIENTO",null,null,null,"ÁREA DE PROCESAMIENTO",null,null,null,{"$f":"AE77*100/AE232","v":0},{"$f":"AF77*100/AE232","v":0},{"$f":"AG77*100/AG232","v":0},{"$f":"AH77*100/AG232","v":0},{"$f":"AI77*100/AI232","v":0},{"$f":"AJ77*100/AI232","v":0},{"$f":"AK77*100/AK232","v":5.2631578947368425},{"$f":"AL77*100/AK232","v":0},{"$f":"AM77*100/AM232","v":0},{"$f":"AN77*100/AM232","v":0},{"$f":"AO77*100/AO232","v":{"$error":"#DIV/0!"}},{"$f":"AP77*100/AO232","v":{"$error":"#DIV/0!"}},{"$f":"AQ77*100/AQ232","v":0},{"$f":"AR77*100/AQ232","v":0},{"$f":"AS77*100/AS232","v":0},{"$f":"AT77*100/AS232","v":0}]
[{"$f":"Infraestructura!$W$253","v":"ÁREA DE RECEPCIÓN, ALMACENAMIENTO Y SUMINISTRO (CON CONTROL DE ACCESO)"},null,null,null,{"$f":"Infraestructura!$AF$253*50/100/100","v":0},{"$f":"Infraestructura!$AE$253*50/100/100","v":1.5151515151515148E-2},{"$f":"IF(Infraestructura!$E$250=Infraestructura!$F$250, \"CUMPLE\", \"NO CUMPLE\")","v":"NO CUMPLE"},null,null,null,null,null,null,null,null,null,null,null,null,null,null,18,"SERVICIOS DE APOYO",null,null,null,"SERVICIOS DE APOYO",null,null,null,{"$f":"AE83*100/AE232","v":21.212121212121211},{"$f":"AF83*100/AE232","v":0},{"$f":"AG83*100/AG232","v":50},{"$f":"AH83*100/AG232","v":0},{"$f":"AI83*100/AI232","v":100},{"$f":"AJ83*100/AI232","v":0},{"$f":"AK83*100/AK232","v":21.05263157894737},{"$f":"AL83*100/AK232","v":0},{"$f":"AM83*100/AM232","v":0},{"$f":"AN83*100/AM232","v":0},{"$f":"AO83*100/AO232","v":{"$error":"#DIV/0!"}},{"$f":"AP83*100/AO232","v":{"$error":"#DIV/0!"}},{"$f":"AQ83*100/AQ232","v":0},{"$f":"AR83*100/AQ232","v":0},{"$f":"AS83*100/AS232","v":0},{"$f":"AT83*100/AS232","v":0}]
[{"$f":"Infraestructura!$W$254","v":"ÁREA TECNICA"},null,null,null,{"$f":"Infraestructura!$AF$254*50/100/100","v":0},{"$f":"Infraestructura!$AE$254*50/100/100","v":4.5454545454545456E-2},{"$f":"IF(Infraestructura!$E$251=Infraestructura!$F$251, \"CUMPLE\", \"NO CUMPLE\")","v":"NO CUMPLE"},null,null,null,null,null,null,null,null,null,null,null,null,null,null,19,"FARMACIA",null,null,null,"FARMACIA",null,null,null,{"$f":"AE84*100/AE232","v":15.151515151515152},{"$f":"AF84*100/AE232","v":0},{"$f":"AG84*100/AG232","v":0},{"$f":"AH84*100/AG232","v":0},{"$f":"AI84*100/AI232","v":100},{"$f":"AJ84*100/AI232","v":0},{"$f":"AK84*100/AK232","v":15.789473684210526},{"$f":"AL84*100/AK232","v":0},{"$f":"AM84*100/AM232","v":0},{"$f":"AN84*100/AM232","v":0},{"$f":"AO84*100/AO232","v":{"$error":"#DIV/0!"}},{"$f":"AP84*100/AO232","v":{"$error":"#DIV/0!"}},{"$f":"AQ84*100/AQ232","v":0},{"$f":"AR84*100/AQ232","v":0},{"$f":"AS84*100/AS232","v":0},{"$f":"AT84*100/AS232","v":0}]
[{"$f":"Infraestructura!$W$255","v":"INFORMÁTICA"},null,null,{"$f":"Infraestructura!$AF$255*50/100/100","v":0},null,{"$f":"Infraestructura!$AE$255*50/100/100","v":0},{"$f":"IF(Infraestructura!$D$252=Infraestructura!$F$252, \"CUMPLE\", \"NO CUMPLE\")","v":"CUMPLE"},null,null,null,null,null,null,null,null,null,null,null,null,null,null,20,"ÁREA ADMINISTRATIVA Y DE PERSONAL",null,null,null,"ÁREA ADMINISTRATIVA Y DE PERSONAL",null,null,null,{"$f":"AE85*100/AE232","v":3.0303030303030303},{"$f":"AF85*100/AE232","v":0},{"$f":"AG85*100/AG232","v":0},{"$f":"AH85*100/AG232","v":0},{"$f":"AI85*100/AI232","v":50},{"$f":"AJ85*100/AI232","v":0},{"$f":"AK85*100/AK232","v":10.526315789473685},{"$f":"AL85*100/AK232","v":0},{"$f":"AM85*100/AM232","v":0},{"$f":"AN85*100/AM232","v":0},{"$f":"AO85*100/AO232","v":{"$error":"#DIV/0!"}},{"$f":"AP85*100/AO232","v":{"$error":"#DIV/0!"}},{"$f":"AQ85*100/AQ232","v":0},{"$f":"AR85*100/AQ232","v":0},{"$f":"AS85*100/AS232","v":0},{"$f":"AT85*100/AS232","v":0}]
[{"$f":"Infraestructura!$W$256","v":"ÁREA TÉCNICA"},null,null,",",{"$f":"Infraestructura!$AF$256*50/100/100","v":0},{"$f":"Infraestructura!$AE$256*50/100/100","v":0},{"$f":"IF(Infraestructura!$E$253=Infraestructura!$F$253, \"CUMPLE\", \"NO CUMPLE\")","v":"CUMPLE"},null,null,null,null,null,null,null,null,null,null,null,null,null,null,21,"ÁREA DE RECEPCIÓN, ALMACENAMIENTO Y SUMINISTRO (CON CONTROL DE ACCESO)",null,null,null,"ÁREA DE RECEPCIÓN, ALMACENAMIENTO Y SUMINISTRO (CON CONTROL DE ACCESO)",null,null,null,{"$f":"AE94*100/AE232","v":3.0303030303030303},{"$f":"AF94*100/AE232","v":0},{"$f":"AG94*100/AG232","v":0},{"$f":"AH94*100/AG232","v":0},{"$f":"AI94*100/AI232","v":50},{"$f":"AJ94*100/AI232","v":0},{"$f":"AK94*100/AK232","v":5.2631578947368425},{"$f":"AL94*100/AK232","v":0},{"$f":"AM94*100/AM232","v":0},{"$f":"AN94*100/AM232","v":0},{"$f":"AO94*100/AO232","v":{"$error":"#DIV/0!"}},{"$f":"AP94*100/AO232","v":{"$error":"#DIV/0!"}},{"$f":"AQ94*100/AQ232","v":0},{"$f":"AR94*100/AQ232","v":0},{"$f":"AS94*100/AS232","v":0},{"$f":"AT94*100/AS232","v":0}]
[{"$f":"Infraestructura!$W$257","v":"REGISTROS Y ARCHIVOS CLÍNICOS"},null,null,{"$f":"Infraestructura!$AF$257*50/100/100","v":0},null,{"$f":"Infraestructura!$AE$257*50/100/100","v":0},{"$f":"IF(Infraestructura!$D$254=Infraestructura!$F$254, \"CUMPLE\", \"NO CUMPLE\")","v":"CUMPLE"},null,null,null,null,null,null,null,null,null,null,null,null,null,null,22,"ÁREA TECNICA",null,null,null,"ÁREA TECNICA",null,null,null,{"$f":"AE102*100/AE232","v":9.0909090909090917},{"$f":"AF102*100/AE232","v":0},{"$f":"AG102*100/AG232","v":0},{"$f":"AH10*100/AG232","v":0},{"$f":"AI102*100/AI232","v":0},{"$f":"AJ102*100/AI232","v":0},{"$f":"AK102*100/AK232","v":0},{"$f":"AL102*100/AK232","v":0},{"$f":"AM102*100/AM232","v":0},{"$f":"AN102*100/AM232","v":0},{"$f":"AO102*100/AO232","v":{"$error":"#DIV/0!"}},{"$f":"AP102*100/AO232","v":{"$error":"#DIV/0!"}},{"$f":"AQ102*100/AQ232","v":0},{"$f":"AR102*100/AQ232","v":0},{"$f":"AS102*100/AS232","v":0},{"$f":"AT102*100/AS232","v":0}]
[{"$f":"W258","v":"ÁREA DE ARCHIVO"},null,null,null,{"$f":"Infraestructura!$AF$258*50/100/100","v":0},{"$f":"Infraestructura!$AE$258*50/100/100","v":0.10606060606060605},{"$f":"IF(Infraestructura!$E$255=Infraestructura!$F$255, \"CUMPLE\", \"NO CUMPLE\")","v":"NO CUMPLE"},null,null,null,null,null,null,null,null,null,null,null,null,null,null,23,"INFORMÁTICA",null,null,null,"INFORMÁTICA",null,null,null,{"$f":"AE66*100/AE232","v":0},{"$f":"AF66*100/AE232","v":0},{"$f":"AG66*100/AG232","v":0},{"$f":"AH66*100/AG232","v":0},{"$f":"AI66*100/AI232","v":0},{"$f":"AJ66*100/AI232","v":0},{"$f":"AK66*100/AK232","v":26.315789473684209},{"$f":"AL66*100/AK232","v":0},{"$f":"AM66*100/AM232","v":0},{"$f":"AN66*100/AM232","v":0},{"$f":"AO66*100/AO232","v":{"$error":"#DIV/0!"}},{"$f":"AP66*100/AO232","v":{"$error":"#DIV/0!"}},{"$f":"AQ66*100/AQ232","v":0},{"$f":"AR66*100/AQ232","v":0},{"$f":"AS66*100/AS232","v":0},{"$f":"AT66*100/AS232","v":0}]
["ÁREA TÉCNICA",null,null,null,{"$f":"Infraestructura!$AF$259*50/100/100","v":0},{"$f":"Infraestructura!$AE$259*50/100/100","v":7.575757575757576E-2},{"$f":"IF(Infraestructura!$E$256=Infraestructura!$F$256, \"CUMPLE\", \"NO CUMPLE\")","v":"NO CUMPLE"},null,null,null,null,null,null,null,null,null,null,null,null,null,null,24,"ÁREA TÉCNICA",null,null,null,"ÁREA TÉCNICA",null,null,null,{"$f":"AE68*100/AE232","v":0},{"$f":"AF68*100/AE232","v":0},{"$f":"AG68*100/AG232","v":0},{"$f":"AH68*100/AG232","v":0},{"$f":"AI68*100/AI232","v":0},{"$f":"AJ68*100/AI232","v":0},{"$f":"AK68*100/AK232","v":21.05263157894737},{"$f":"AL68*100/AK232","v":0},{"$f":"AM68*100/AM232","v":0},{"$f":"AN68*100/AM232","v":0},{"$f":"AO68*100/AO232","v":{"$error":"#DIV/0!"}},{"$f":"AP68*100/AO232","v":{"$error":"#DIV/0!"}},{"$f":"AQ68*100/AQ232","v":0},{"$f":"AR68*100/AQ232","v":0},{"$f":"AS68*100/AS232","v":0},{"$f":"AT68*100/AS232","v":0}]
["SERVICIO DE ADMINISTRACIÓN",null,{"$f":"Infraestructura!$AF$260*50/100/100","v":0},null,null,{"$f":"Infraestructura!$AE$260*50/100/100","v":6.0606060606060594E-2},{"$f":"IF(Infraestructura!$C$257=Infraestructura!$F$257, \"CUMPLE\", \"NO CUMPLE\")","v":"NO CUMPLE"},null,null,null,null,null,null,null,null,null,null,null,null,null,null,25,"REGISTROS Y ARCHIVOS CLÍNICOS",null,null,null,"REGISTROS Y ARCHIVOS CLÍNICOS",null,null,null,{"$f":"AE77*100/AE232","v":0},{"$f":"AF77*100/AE232","v":0},{"$f":"AG77*100/AG232","v":0},{"$f":"AH77*100/AG232","v":0},{"$f":"AI77*100/AI232","v":0},{"$f":"AJ77*100/AI232","v":0},{"$f":"AK77*100/AK232","v":5.2631578947368425},{"$f":"AL77*100/AK232","v":0},{"$f":"AM77*100/AM232","v":0},{"$f":"AN77*100/AM232","v":0},{"$f":"AO77*100/AO232","v":{"$error":"#DIV/0!"}},{"$f":"AP77*100/AO232","v":{"$error":"#DIV/0!"}},{"$f":"AQ77*100/AQ232","v":0},{"$f":"AR77*100/AQ232","v":0},{"$f":"AS77*100/AS232","v":0},{"$f":"AT77*100/AS232","v":0}]
["DIRECCIÓN Y GESTIÓN ADMINISTRATIVA",null,null,{"$f":"Infraestructura!$AF$261*50/100/100","v":0},null,{"$f":"Infraestructura!$AE$261*50/100/100","v":6.0606060606060594E-2},{"$f":"IF(Infraestructura!$D$258=Infraestructura!$F$258, \"CUMPLE\", \"NO CUMPLE\")","v":"NO CUMPLE"},null,null,null,null,null,null,null,null,null,null,null,null,null,null,26,"ÁREA DE ARCHIVO",null,null,null,"ÁREA DE ARCHIVO",null,null,null,{"$f":"AE83*100/AE232","v":21.212121212121211},{"$f":"AF83*100/AE232","v":0},{"$f":"AG83*100/AG232","v":50},{"$f":"AH83*100/AG232","v":0},{"$f":"AI83*100/AI232","v":100},{"$f":"AJ83*100/AI232","v":0},{"$f":"AK83*100/AK232","v":21.05263157894737},{"$f":"AL83*100/AK232","v":0},{"$f":"AM83*100/AM232","v":0},{"$f":"AN83*100/AM232","v":0},{"$f":"AO83*100/AO232","v":{"$error":"#DIV/0!"}},{"$f":"AP83*100/AO232","v":{"$error":"#DIV/0!"}},{"$f":"AQ83*100/AQ232","v":0},{"$f":"AR83*100/AQ232","v":0},{"$f":"AS83*100/AS232","v":0},{"$f":"AT83*100/AS232","v":0}]
["DIRECCIÓN",null,null,null,{"$f":"Infraestructura!$AF$262*50/100/100","v":0},{"$f":"Infraestructura!$AE$262*50/100/100","v":4.5454545454545456E-2},{"$f":"IF(Infraestructura!$E$259=Infraestructura!$F$259, \"CUMPLE\", \"NO CUMPLE\")","v":"NO CUMPLE"},null,null,null,null,null,null,null,null,null,null,null,null,null,null,27,"ÁREA TÉCNICA",null,null,null,"ÁREA TÉCNICA",null,null,null,{"$f":"AE84*100/AE232","v":15.151515151515152},{"$f":"AF84*100/AE232","v":0},{"$f":"AG84*100/AG232","v":0},{"$f":"AH84*100/AG232","v":0},{"$f":"AI84*100/AI232","v":100},{"$f":"AJ84*100/AI232","v":0},{"$f":"AK84*100/AK232","v":15.789473684210526},{"$f":"AL84*100/AK232","v":0},{"$f":"AM84*100/AM232","v":0},{"$f":"AN84*100/AM232","v":0},{"$f":"AO84*100/AO232","v":{"$error":"#DIV/0!"}},{"$f":"AP84*100/AO232","v":{"$error":"#DIV/0!"}},{"$f":"AQ84*100/AQ232","v":0},{"$f":"AR84*100/AQ232","v":0},{"$f":"AS84*100/AS232","v":0},{"$f":"AT84*100/AS232","v":0}]
["DIRECCIÓN DE TALENTO HUMANO",null,null,null,{"$f":"Infraestructura!$AF$263*50/100/100","v":0},{"$f":"Infraestructura!$AE$263*50/100/100","v":0},{"$f":"IF(Infraestructura!$E$260=Infraestructura!$F$260, \"CUMPLE\", \"NO CUMPLE\")","v":"CUMPLE"},null,null,null,null,null,null,null,null,null,null,null,null,null,null,28,"SERVICIO DE ADMINISTRACIÓN",null,null,null,"SERVICIO DE ADMINISTRACIÓN",null,null,null,{"$f":"AE132*100/AE232","v":12.121212121212121},{"$f":"AF132*100/AE232","v":0},{"$f":"AG132*100/AG232","v":0},{"$f":"AH132*100/AG232","v":0},{"$f":"AI132*100/AI232","v":0},{"$f":"AJ132*100/AI232","v":0},{"$f":"AK132*100/AK232","v":26.315789473684209},{"$f":"AL132*100/AK232","v":0},{"$f":"AM132*100/AM232","v":0},{"$f":"AN132*100/AM232","v":0},{"$f":"AO132*100/AO232","v":{"$error":"#DIV/0!"}},{"$f":"AP132*100/AO232","v":{"$error":"#DIV/0!"}},{"$f":"AQ132*100/AQ232","v":0},{"$f":"AR132*100/AQ232","v":0},{"$f":"AS132*100/AS232","v":0},{"$f":"AT132*100/AS232","v":0}]
["DIRECCIÓN ADMINISTRATIVO-FINANCIERA",null,null,null,{"$f":"Infraestructura!$AF$264*50/100/100","v":0},{"$f":"Infraestructura!$AE$264*50/100/100","v":0},{"$f":"IF(Infraestructura!$E$261=Infraestructura!$F$261, \"CUMPLE\", \"NO CUMPLE\")","v":"CUMPLE"},null,null,null,null,null,null,null,null,null,null,null,null,null,null,29,"DIRECCIÓN Y GESTIÓN ADMINISTRATIVA",null,null,null,"DIRECCIÓN Y GESTIÓN ADMINISTRATIVA",null,null,null,{"$f":"AE133*100/AE232","v":12.121212121212121},{"$f":"AF133*100/AE232","v":0},{"$f":"AG133*100/AG232","v":0},{"$f":"AH133*100/AG232","v":0},{"$f":"AI133*100/AI232","v":0},{"$f":"AJ133*100/AI232","v":0},{"$f":"AK133*100/AK232","v":26.315789473684209},{"$f":"AL133*100/AK232","v":0},{"$f":"AM133*100/AM232","v":0},{"$f":"AN133*100/AM232","v":0},{"$f":"AO133*100/AO232","v":{"$error":"#DIV/0!"}},{"$f":"AP133*100/AO232","v":{"$error":"#DIV/0!"}},{"$f":"AQ133*100/AQ232","v":0},{"$f":"AR133*100/AQ232","v":0},{"$f":"AS133*100/AS232","v":0},{"$f":"AT133*100/AS232","v":0}]
["ZONA DE APOYO DE LA DIRECCIÓN ",null,null,null,{"$f":"Infraestructura!$AF$265*50/100/100","v":0},{"$f":"Infraestructura!$AE$265*50/100/100","v":1.5151515151515148E-2},{"$f":"IF(Infraestructura!$E$262=Infraestructura!$F$262, \"CUMPLE\", \"NO CUMPLE\")","v":"NO CUMPLE"},null,null,null,null,null,null,null,null,null,null,null,null,null,null,30,"DIRECCIÓN",null,null,null,"DIRECCIÓN",null,null,null,{"$f":"AE134*100/AE232","v":9.0909090909090917},{"$f":"AF134*100/AE232","v":0},{"$f":"AG134*100/AG232","v":0},{"$f":"AH134*100/AG232","v":0},{"$f":"AI134*100/AI232","v":0},{"$f":"AJ134*100/AI232","v":0},{"$f":"AK134*100/AK232","v":5.2631578947368425},{"$f":"AL134*100/AK232","v":0},{"$f":"AM134*100/AM232","v":0},{"$f":"AN134*100/AM232","v":0},{"$f":"AO134*100/AO232","v":{"$error":"#DIV/0!"}},{"$f":"AP134*100/AO232","v":{"$error":"#DIV/0!"}},{"$f":"AQ134*100/AQ232","v":0},{"$f":"AR134*100/AQ232","v":0},{"$f":"AS134*100/AS232","v":0},{"$f":"AT134*100/AS232","v":0}]
["SERVICIOS GENERALES",null,{"$f":"Infraestructura!$AF$266*50/100/100","v":0},null,null,{"$f":"Infraestructura!$AE$266*50/100/100","v":0.10606060606060605},{"$f":"IF(Infraestructura!$C$263=Infraestructura!$F$263, \"CUMPLE\", \"NO CUMPLE\")","v":"NO CUMPLE"},null,null,null,null,null,null,null,null,null,null,null,null,null,null,31,"DIRECCIÓN DE TALENTO HUMANO",null,null,null,"DIRECCIÓN DE TALENTO HUMANO",null,null,null,{"$f":"AE143*100/AE232","v":0},{"$f":"AF143*100/AE232","v":0},{"$f":"AG143*100/AG232","v":0},{"$f":"AH143*100/AG232","v":0},{"$f":"AI143*100/AI232","v":0},{"$f":"AJ143*100/AI232","v":0},{"$f":"AK143*100/AK232","v":5.2631578947368425},{"$f":"AL143*100/AK232","v":0},{"$f":"AM143*100/AM232","v":0},{"$f":"AN143*100/AM232","v":0},{"$f":"AO143*100/AO232","v":{"$error":"#DIV/0!"}},{"$f":"AP143*100/AO232","v":{"$error":"#DIV/0!"}},{"$f":"AQ143*100/AQ232","v":0},{"$f":"AR143*100/AQ232","v":0},{"$f":"AS143*100/AS232","v":0},{"$f":"AT143*100/AS232","v":0}]
[{"$f":"Infraestructura!$W$267","v":"BODEGA"},null,null,{"$f":"Infraestructura!$AF$267*50/100/100","v":0},null,{"$f":"Infraestructura!$AE$267*50/100/100","v":1.5151515151515148E-2},{"$f":"IF(Infraestructura!$D$264=Infraestructura!$F$264, \"CUMPLE\", \"NO CUMPLE\")","v":"NO CUMPLE"},null,null,null,null,null,null,null,null,null,null,null,null,null,null,32,"DIRECCIÓN ADMINISTRATIVO-FINANCIERA",null,null,null,"DIRECCIÓN ADMINISTRATIVO-FINANCIERA",null,null,null,{"$f":"AE149*100/AE232","v":0},{"$f":"AF149*100/AE232","v":0},{"$f":"AG149*100/AG232","v":0},{"$f":"AH149*100/AG232","v":0},{"$f":"AI149*100/AI232","v":0},{"$f":"AJ149*100/AI232","v":0},{"$f":"AK149*100/AK232","v":5.2631578947368425},{"$f":"AL149*100/AK232","v":0},{"$f":"AM149*100/AM232","v":0},{"$f":"AN149*100/AM232","v":0},{"$f":"AO149*100/AO232","v":{"$error":"#DIV/0!"}},{"$f":"AP149*100/AO232","v":{"$error":"#DIV/0!"}},{"$f":"AQ149*100/AQ232","v":0},{"$f":"AR149*100/AQ232","v":0},{"$f":"AS149*100/AS232","v":0},{"$f":"AT149*100/AS232","v":0}]
[{"$f":"Infraestructura!$W$268","v":"ÁREA DE ACCESO DE RECEPCION"},null,null,null,{"$f":"Infraestructura!$AF$268*50/100/100","v":0},{"$f":"Infraestructura!$AE$268*50/100/100","v":0},{"$f":"IF(Infraestructura!$E$265=Infraestructura!$F$265, \"CUMPLE\", \"NO CUMPLE\")","v":"CUMPLE"},null,null,null,null,null,null,null,null,null,null,null,null,null,null,33,"ZONA DE APOYO DE LA DIRECCIÓN ",null,null,null,"ZONA DE APOYO DE LA DIRECCIÓN ",null,null,null,{"$f":"AE155*100/AE232","v":3.0303030303030303},{"$f":"AF155*100/AE232","v":0},{"$f":"AG155*100/AG232","v":0},{"$f":"AH155*100/AG232","v":0},{"$f":"AI155*100/AI232","v":0},{"$f":"AJ155*100/AI232","v":0},{"$f":"AK155*100/AK232","v":10.526315789473685},{"$f":"AL155*100/AK232","v":0},{"$f":"AM155*100/AM232","v":0},{"$f":"AN155*100/AM232","v":0},{"$f":"AO155*100/AO232","v":{"$error":"#DIV/0!"}},{"$f":"AP155*100/AO232","v":{"$error":"#DIV/0!"}},{"$f":"AQ155*100/AQ232","v":0},{"$f":"AR155*100/AQ232","v":0},{"$f":"AS155*100/AS232","v":0},{"$f":"AT155*100/AS232","v":0}]
[{"$f":"Infraestructura!$W$269","v":"ÁREA DE ALMACENES"},null,null,null,{"$f":"Infraestructura!$AF$269*50/100/100","v":0},{"$f":"Infraestructura!$AE$269*50/100/100","v":1.5151515151515148E-2},{"$f":"IF(Infraestructura!$E$266=Infraestructura!$F$266, \"CUMPLE\", \"NO CUMPLE\")","v":"NO CUMPLE"},null,null,null,null,null,null,null,null,null,null,null,null,null,null,34,"SERVICIOS GENERALES",null,null,null,"SERVICIOS GENERALES",null,null,null,{"$f":"AE163*100/AE232","v":21.212121212121211},{"$f":"AF163*100/AE232","v":0},{"$f":"AG163*100/AG232","v":50},{"$f":"AH163*100/AG232","v":0},{"$f":"AI163*100/AI232","v":0},{"$f":"AJ163*100/AI232","v":0},{"$f":"AK163*100/AK232","v":5.2631578947368425},{"$f":"AL163*100/AK232","v":0},{"$f":"AM163*100/AM232","v":0},{"$f":"AN163*100/AM232","v":0},{"$f":"AO163*100/AO232","v":{"$error":"#DIV/0!"}},{"$f":"AP163*100/AO232","v":{"$error":"#DIV/0!"}},{"$f":"AQ163*100/AQ232","v":0},{"$f":"AR163*100/AQ232","v":0},{"$f":"AS163*100/AS232","v":66.666666666666671},{"$f":"AT163*100/AS232","v":0}]
[{"$f":"Infraestructura!$W$270","v":"LIMPIEZA"},null,null,{"$f":"Infraestructura!$AF$270*50/100/100","v":0},null,{"$f":"Infraestructura!$AE$270*50/100/100","v":1.5151515151515148E-2},{"$f":"IF(Infraestructura!$D$267=Infraestructura!$F$267, \"CUMPLE\", \"NO CUMPLE\")","v":"NO CUMPLE"},null,null,null,null,null,null,null,null,null,null,null,null,null,null,35,"BODEGA",null,null,null,"BODEGA",null,null,null,{"$f":"AE164*100/AE232","v":3.0303030303030303},{"$f":"AF164*100/AE232","v":0},{"$f":"AG164*100/AG232","v":50},{"$f":"AH164*100/AG232","v":0},{"$f":"AI164*100/AI232","v":0},{"$f":"AJ164*100/AI232","v":0},{"$f":"AK164*100/AK232","v":0},{"$f":"AL164*100/AK232","v":0},{"$f":"AM164*100/AM232","v":0},{"$f":"AN164*100/AM232","v":0},{"$f":"AO164*100/AO232","v":{"$error":"#DIV/0!"}},{"$f":"AP164*100/AO232","v":{"$error":"#DIV/0!"}},{"$f":"AQ164*100/AQ232","v":0},{"$f":"AR164*100/AQ232","v":0},{"$f":"AS164*100/AS232","v":0},{"$f":"AT164*100/AS232","v":0}]
[{"$f":"Infraestructura!$W$271","v":"ÁREA DE ALMACENES DE PRODUCTOS Y EQUIPOS DE LIMPIEZA"},null,null,null,{"$f":"Infraestructura!$AF$271*50/100/100","v":0},{"$f":"Infraestructura!$AE$271*50/100/100","v":1.5151515151515148E-2},{"$f":"IF(Infraestructura!$E$268=Infraestructura!$F$268, \"CUMPLE\", \"NO CUMPLE\")","v":"NO CUMPLE"},null,null,null,null,null,null,null,null,null,null,null,null,null,null,36,"ÁREA DE ACCESO DE RECEPCION",null,null,null,"ÁREA DE ACCESO DE RECEPCION",null,null,null,{"$f":"AE165*100/AE232","v":0},{"$f":"AF165*100/AE232","v":0},{"$f":"AG165*100/AG232","v":50},{"$f":"AH165*100/AG232","v":0},{"$f":"AI165*100/AI232","v":0},{"$f":"AJ165*100/AI232","v":0},{"$f":"AK165*100/AK232","v":0},{"$f":"AL165*100/AK232","v":0},{"$f":"AM165*100/AM232","v":0},{"$f":"AN165*100/AM232","v":0},{"$f":"AO165*100/AO232","v":{"$error":"#DIV/0!"}},{"$f":"AP165*100/AO232","v":{"$error":"#DIV/0!"}},{"$f":"AQ165*100/AQ232","v":0},{"$f":"AR165*100/AQ232","v":0},{"$f":"AS165*100/AS232","v":0},{"$f":"AT165*100/AS232","v":0}]
[{"$f":"Infraestructura!$W$272","v":"VESTUARIOS GENERAL"},null,null,{"$f":"Infraestructura!$AF$272*50/100/100","v":0},null,{"$f":"Infraestructura!$AE$272*50/100/100","v":3.0303030303030297E-2},{"$f":"IF(Infraestructura!$D$269=Infraestructura!$F$269, \"CUMPLE\", \"NO CUMPLE\")","v":"NO CUMPLE"},null,null,null,null,null,null,null,null,null,null,null,null,null,null,37,"ÁREA DE ALMACENES",null,null,null,"ÁREA DE ALMACENES",null,null,null,{"$f":"AE172*100/AE232","v":3.0303030303030303},{"$f":"AF172*100/AE232","v":0},{"$f":"AG172*100/AG232","v":0},{"$f":"AH172*100/AG232","v":0},{"$f":"AI172*100/AI232","v":0},{"$f":"AJ172*100/AI232","v":0},{"$f":"AK172*100/AK232","v":0},{"$f":"AL172*100/AK232","v":0},{"$f":"AM172*100/AM232","v":0},{"$f":"AN172*100/AM232","v":0},{"$f":"AO172*100/AO232","v":{"$error":"#DIV/0!"}},{"$f":"AP172*100/AO232","v":{"$error":"#DIV/0!"}},{"$f":"AQ172*100/AQ232","v":0},{"$f":"AR172*100/AQ232","v":0},{"$f":"AS172*100/AS232","v":0},{"$f":"AT172*100/AS232","v":0}]
[{"$f":"Infraestructura!$W$273","v":"ÁREA DE PERSONAL"},null,null,null,{"$f":"Infraestructura!$AF$273*50/100/100","v":0},{"$f":"Infraestructura!$AE$273*50/100/100","v":3.0303030303030297E-2},{"$f":"IF(Infraestructura!$E$270=Infraestructura!$F$270, \"CUMPLE\", \"NO CUMPLE\")","v":"NO CUMPLE"},null,null,null,null,null,null,null,null,null,null,null,null,null,null,38,"LIMPIEZA",null,null,null,"LIMPIEZA",null,null,null,{"$f":"AE178*100/AE232","v":3.0303030303030303},{"$f":"AF178*100/AE232","v":0},{"$f":"AG178*100/AG232","v":0},{"$f":"AH178*100/AG232","v":0},{"$f":"AI178*100/AI232","v":0},{"$f":"AJ178*100/AI232","v":0},{"$f":"AK178*100/AK232","v":0},{"$f":"AL178*100/AK232","v":0},{"$f":"AM178*100/AM232","v":0},{"$f":"AN178*100/AM232","v":0},{"$f":"AO178*100/AO232","v":{"$error":"#DIV/0!"}},{"$f":"AP178*100/AO232","v":{"$error":"#DIV/0!"}},{"$f":"AQ178*100/AQ232","v":0},{"$f":"AR178*100/AQ232","v":0},{"$f":"AS178*100/AS232","v":0},{"$f":"AT178*100/AS232","v":0}]
[{"$f":"Infraestructura!$W$274","v":"MANTENIMIENTO"},null,null,{"$f":"Infraestructura!$AF$274*50/100/100","v":0},null,{"$f":"Infraestructura!$AE$274*50/100/100","v":0},{"$f":"IF(Infraestructura!$D$271=Infraestructura!$F$271, \"CUMPLE\", \"NO CUMPLE\")","v":"CUMPLE"},null,null,null,null,null,null,null,null,null,null,null,null,null,null,39,"ÁREA DE ALMACENES DE PRODUCTOS Y EQUIPOS DE LIMPIEZA",null,null,null,"ÁREA DE ALMACENES DE PRODUCTOS Y EQUIPOS DE LIMPIEZA",null,null,null,{"$f":"AE179*100/AE232","v":3.0303030303030303},{"$f":"AF179*100/AE232","v":0},{"$f":"AG179*100/AG232","v":0},{"$f":"AH179*100/AG232","v":0},{"$f":"AI179*100/AI232","v":0},{"$f":"AJ179*100/AI232","v":0},{"$f":"AK179*100/AK232","v":0},{"$f":"AL179*100/AK232","v":0},{"$f":"AM179*100/AM232","v":0},{"$f":"AN179*100/AM232","v":0},{"$f":"AO179*100/AO232","v":{"$error":"#DIV/0!"}},{"$f":"AP179*100/AO232","v":{"$error":"#DIV/0!"}},{"$f":"AQ179*100/AQ232","v":0},{"$f":"AR179*100/AQ232","v":0},{"$f":"AS179*100/AS232","v":0},{"$f":"AT179*100/AS232","v":0}]
[{"$f":"Infraestructura!$W$275","v":"ÁREA TÉCNICA"},null,null,null,{"$f":"Infraestructura!$AF$275*50/100/100","v":0},{"$f":"Infraestructura!$AE$275*50/100/100","v":0},{"$f":"IF(Infraestructura!$E$272=Infraestructura!$F$272, \"CUMPLE\", \"NO CUMPLE\")","v":"CUMPLE"},null,null,null,null,null,null,null,null,null,null,null,null,null,null,40,"VESTUARIOS GENERAL",null,null,null,"VESTUARIOS GENERAL",null,null,null,{"$f":"AE185*100/AE232","v":6.0606060606060606},{"$f":"AF185*100/AE232","v":0},{"$f":"AG185*100/AG232","v":0},{"$f":"AH185*100/AG232","v":0},{"$f":"AI185*100/AI232","v":0},{"$f":"AJ185*100/AI232","v":0},{"$f":"AK185*100/AK232","v":0},{"$f":"AL185*100/AK232","v":0},{"$f":"AM185*100/AM232","v":0},{"$f":"AN185*100/AM232","v":0},{"$f":"AO185*100/AO232","v":{"$error":"#DIV/0!"}},{"$f":"AP185*100/AO232","v":{"$error":"#DIV/0!"}},{"$f":"AQ185*100/AQ232","v":0},{"$f":"AR185*100/AQ232","v":0},{"$f":"AS185*100/AS232","v":0},{"$f":"AT185*100/AS232","v":0}]
[{"$f":"Infraestructura!$W$276","v":"ALMACENAMIENTO FINAL DE DESECHOS"},null,null,{"$f":"Infraestructura!$AF$276*50/100/100","v":0},null,{"$f":"Infraestructura!$AE$276*50/100/100","v":4.5454545454545456E-2},{"$f":"IF(Infraestructura!$D$273=Infraestructura!$F$273, \"CUMPLE\", \"NO CUMPLE\")","v":"NO CUMPLE"},null,null,null,null,null,null,null,null,null,null,null,null,null,null,41,"ÁREA DE PERSONAL",null,null,null,"ÁREA DE PERSONAL",null,null,null,{"$f":"AE186*100/AE232","v":6.0606060606060606},{"$f":"AF186*100/AE232","v":0},{"$f":"AG186*100/AG232","v":0},{"$f":"AH186*100/AG232","v":0},{"$f":"AI186*100/AI232","v":0},{"$f":"AJ186*100/AI232","v":0},{"$f":"AK186*100/AK232","v":0},{"$f":"AL186*100/AK232","v":0},{"$f":"AM186*100/AM232","v":0},{"$f":"AN186*100/AM232","v":0},{"$f":"AO186*100/AO232","v":{"$error":"#DIV/0!"}},{"$f":"AP186*100/AO232","v":{"$error":"#DIV/0!"}},{"$f":"AQ186*100/AQ232","v":0},{"$f":"AR186*100/AQ232","v":0},{"$f":"AS186*100/AS232","v":0},{"$f":"AT186*100/AS232","v":0}]
[{"$f":"Infraestructura!$W$277","v":"ÁREA TÉCNICA"},null,null,null,{"$f":"Infraestructura!$AF$277*50/100/100","v":0},{"$f":"Infraestructura!$AE$277*50/100/100","v":4.5454545454545456E-2},{"$f":"IF(Infraestructura!$E$274=Infraestructura!$F$274, \"CUMPLE\", \"NO CUMPLE\")","v":"NO CUMPLE"},null,null,null,null,null,null,null,null,null,null,null,null,null,null,42,"MANTENIMIENTO",null,null,null,"MANTENIMIENTO",null,null,null,{"$f":"AE194*100/AE232","v":0},{"$f":"AF194*100/AE232","v":0},{"$f":"AG194*100/AG232","v":0},{"$f":"AH194*100/AG232","v":0},{"$f":"AI194*100/AI232","v":0},{"$f":"AJ194*100/AI232","v":0},{"$f":"AK194*100/AK232","v":5.2631578947368425},{"$f":"AL194*100/AK232","v":0},{"$f":"AM194*100/AM232","v":0},{"$f":"AN194*100/AM232","v":0},{"$f":"AO194*100/AO232","v":{"$error":"#DIV/0!"}},{"$f":"AP194*100/AO232","v":{"$error":"#DIV/0!"}},{"$f":"AQ194*100/AQ232","v":0},{"$f":"AR194*100/AQ232","v":0},{"$f":"AS194*100/AS232","v":66.666666666666671},{"$f":"AT194*100/AS232","v":0}]
["TOTAL REQUERIDO:",null,null,null,null,0.5,{"$f":"SUM(Infraestructura!$C$234                                                                  : Infraestructura!$C$274)","v":0},null,null,null,null,null,null,null,null,null,null,null,null,null,null,43,"ÁREA TÉCNICA",null,null,null,"ÁREA TÉCNICA",null,null,null,{"$f":"AE195*100/AE232","v":0},{"$f":"AF195*100/AE232","v":0},{"$f":"AG195*100/AG232","v":0},{"$f":"AH195*100/AG232","v":0},{"$f":"AI195*100/AI232","v":0},{"$f":"AJ195*100/AI232","v":0},{"$f":"AK195*100/AK232","v":5.2631578947368425},{"$f":"AL195*100/AK232","v":0},{"$f":"AM195*100/AM232","v":0},{"$f":"AN195*100/AM232","v":0},{"$f":"AO195*100/AO232","v":{"$error":"#DIV/0!"}},{"$f":"AP195*100/AO232","v":{"$error":"#DIV/0!"}},{"$f":"AQ195*100/AQ232","v":0},{"$f":"AR195*100/AQ232","v":0},{"$f":"AS195*100/AS232","v":66.666666666666671},{"$f":"AT195*100/AS232","v":0}]
["TOTAL OPCIONAL:",null,null,null,null,0.5,{"$f":"Infraestructura!$AH$232*50/Infraestructura!$AG$232/100","v":0},null,null,null,null,null,null,null,null,null,null,null,null,null,null,44,"ALMACENAMIENTO FINAL DE DESECHOS",null,null,null,"ALMACENAMIENTO FINAL DE DESECHOS",null,null,null,{"$f":"AE201*100/AE232","v":9.0909090909090917},{"$f":"AF201*100/AE232","v":0},{"$f":"AG201*100/AG232","v":0},{"$f":"AH201*100/AG232","v":0},{"$f":"AI201*100/AI232","v":0},{"$f":"AJ201*100/AI232","v":0},{"$f":"AK201*100/AK232","v":0},{"$f":"AL201*100/AK232","v":0},{"$f":"AM201*100/AM232","v":0},{"$f":"AN201*100/AM232","v":0},{"$f":"AO201*100/AO232","v":{"$error":"#DIV/0!"}},{"$f":"AP201*100/AO232","v":{"$error":"#DIV/0!"}},{"$f":"AQ201*100/AQ232","v":0},{"$f":"AR201*100/AQ232","v":0},{"$f":"AS201*100/AS232","v":0},{"$f":"AT201*100/AS232","v":0}]
["TOTAL DESEABLE:",null,null,null,null,0.5,{"$f":"Infraestructura!$AJ$232*50/Infraestructura!$AI$232/100","v":0},null,null,null,null,null,null,null,null,null,null,null,null,null,null,45,"ÁREA TÉCNICA",null,null,null,"ÁREA TÉCNICA",null,null,null,{"$f":"AE202*100/AE232","v":9.0909090909090917},{"$f":"AF202*100/AE232","v":0},{"$f":"AG202*100/AG232","v":0},{"$f":"AH202*100/AG232","v":0},{"$f":"AI202*100/AI232","v":0},{"$f":"AJ202*100/AI232","v":0},{"$f":"AK202*100/AK232","v":0},{"$f":"AL202*100/AK232","v":0},{"$f":"AM202*100/AM232","v":0},{"$f":"AN202*100/AM232","v":0},{"$f":"AO202*100/AO232","v":{"$error":"#DIV/0!"}},{"$f":"AP202*100/AO232","v":{"$error":"#DIV/0!"}},{"$f":"AQ202*100/AQ232","v":0},{"$f":"AR202*100/AQ232","v":0},{"$f":"AS202*100/AS232","v":0},{"$f":"AT202*100/AS232","v":0}]
["TOTAL CONDICIÓN:",null,null,null,null,0.5,{"$f":"Infraestructura!$AL$232*50/Infraestructura!$AK$232/100","v":0},null,null,null,null,null,null,null,null,null,null,null,null,null,null,46,"INSTALACIONES DEL LOCAL",null,null,null,null,null,null,null,{"$f":"AE210*100/AE232","v":0},{"$f":"AF210*100/AE232","v":0},{"$f":"AG210*100/AG232","v":0},{"$f":"AH210*100/AG232","v":0},{"$f":"AI210*100/AI232","v":0},{"$f":"AJ210*100/AI232","v":0},{"$f":"AK210*100/AK232","v":0},{"$f":"AL210*100/AK232","v":0},{"$f":"AM210*100/AM232","v":100},{"$f":"AN210*100/AM232","v":0},{"$f":"AO210*100/AO232","v":{"$error":"#DIV/0!"}},{"$f":"AP210*100/AO232","v":{"$error":"#DIV/0!"}},{"$f":"AQ210*100/AQ232","v":100},{"$f":"AR210*100/AQ232","v":0},{"$f":"AS210*100/AS232","v":33.333333333333336},{"$f":"AT210*100/AS232","v":0}]
["INSTALACIONES:",null,"% Obtenido:","% Obtenido:","% Obtenido:","% A Cumplir:","% Final:"]
[{"$f":"Infraestructura!$W$278","v":"INSTALACIONES DEL LOCAL"},null,{"$f":"Infraestructura!$AN$278*50/100/100","v":0},null,null,{"$f":"Infraestructura!$AM$278*50/100/100","v":0.5},{"$f":"IF(Infraestructura!$C$280=Infraestructura!$F$280, \"CUMPLE\", \"NO CUMPLE\")","v":"NO CUMPLE"}]
["TOTAL REQUERIDO:",null,null,null,null,0.5,{"$f":"SUM(C280)","v":0}]
["TOTAL OPCIONAL:",null,null,null,null,0.5,{"$f":"50/100","v":0.5}]
["TOTAL DESEABLE:",null,null,null,null,0.5,{"$f":"50/100","v":0.5}]
["TOTAL CONDICIÓN:",null,null,null,null,0.5,{"$f":"Infraestructura!$AT$232*50/Infraestructura!$AS$232/100","v":0}]
["TOTALES COMPONENTE:"]
["TOTAL % REQUERIDO:",null,null,null,null,0.30000001192092896,{"$f":"(+Infraestructura!$G$275+Infraestructura!$G$281)*30/100","v":0}]
["TOTAL % OPCIONAL:",null,null,null,null,0.30000001192092896,{"$f":"(+Infraestructura!$G$276+Infraestructura!$G$282)*30/100","v":0.15}]
["TOTAL % DESEABLE:",null,null,null,null,0.30000001192092896,{"$f":"(+Infraestructura!$G$277+Infraestructura!$G$283)*30/100","v":0.15}]
["TOTAL % CONDICIÓN:",null,null,null,null,0.30000001192092896,{"$f":"(+Infraestructura!$G$278+Infraestructura!$G$284)*30/100","v":0}]

{"sheet":"Equipamiento","index":5,"n_rows":592,"n_cols":78,"rows_kept":592,"cut":false,"hidden":false,"merged":[[487,0,487,1],[477,0,477,1],[405,0,405,8],[406,0,406,8],[424,0,424,8],[425,0,425,8],[452,0,452,8],[453,0,453,8],[460,0,460,8],[461,0,461,8],[478,0,478,1],[479,0,479,1],[480,0,480,1],[475,0,475,1],[476,0,476,1],[2,46,2,53],[2,54,2,61],[2,62,2,69],[2,70,2,77],[3,0,3,8],[4,0,4,8],[1,0,1,8],[2,0,2,8],[2,14,2,21],[2,22,2,29],[2,30,2,37],[2,38,2,45],[132,0,132,8],[133,0,133,8],[98,0,98,8],[99,0,99,8],[100,0,100,8],[101,0,101,8],[5,0,5,8],[6,0,6,8],[29,0,29,8],[30,0,30,8],[131,0,131,8],[232,0,232,8],[233,0,233,8],[234,0,234,8],[269,0,269,8],[270,0,270,8],[283,0,283,8],[231,0,231,8],[225,0,225,8],[191,0,191,8],[192,0,192,8],[193,0,193,8],[194,0,194,8],[224,0,224,8],[469,38,469,45],[470,38,470,45],[471,38,471,45],[472,38,472,45],[473,38,473,45],[474,38,474,45],[369,0,369,8],[370,0,370,8],[284,0,284,8],[299,0,299,8],[300,0,300,8],[301,0,301,8],[309,0,309,8],[310,0,310,8],[311,0,311,8],[314,0,314,8],[315,0,315,8],[473,0,473,1],[474,0,474,1],[404,0,404,8],[468,0,468,8],[415,0,415,8],[420,0,420,8],[421,0,421,8],[481,38,481,45],[482,38,482,45],[483,38,483,45],[484,38,484,45],[485,38,485,45],[486,38,486,45],[475,38,475,45],[476,38,476,45],[477,38,477,45],[478,38,478,45],[479,38,479,45],[480,38,480,45],[521,38,521,45],[469,0,469,1],[470,0,470,1],[471,0,471,1],[472,0,472,1],[511,38,511,45],[512,38,512,45],[513,38,513,45],[514,38,514,45],[515,38,515,45],[516,38,516,45],[505,38,505,45],[506,38,506,45],[507,38,507,45],[508,38,508,45],[509,38,509,45],[510,38,510,45],[499,38,499,45],[500,38,500,45],[481,0,481,1],[501,38,501,45],[502,38,502,45],[503,38,503,45],[504,38,504,45],[491,0,491,1],[492,0,492,1],[484,0,484,1],[485,0,485,1],[486,0,486,1],[517,38,517,45],[518,38,518,45],[519,38,519,45],[520,38,520,45],[493,38,493,45],[494,38,494,45],[495,38,495,45],[496,38,496,45],[497,38,497,45],[498,38,498,45],[487,38,487,45],[488,38,488,45],[489,38,489,45],[490,38,490,45],[491,38,491,45],[492,38,492,45],[497,0,497,1],[498,0,498,1],[503,0,503,1],[499,0,499,1],[500,0,500,1],[501,0,501,1],[502,0,502,1],[510,0,510,4],[511,0,511,4],[512,0,512,4],[513,0,513,4],[504,0,504,1],[505,0,505,1],[506,0,506,1],[507,0,507,1],[508,0,508,1],[509,0,509,1],[514,0,514,1],[515,0,515,1],[531,0,531,4],[532,0,532,4],[533,0,533,4],[516,0,516,1],[517,0,517,1],[528,0,528,1],[529,0,529,1],[530,0,530,1],[521,0,521,1],[522,0,522,1],[523,0,523,1],[518,0,518,1],[519,0,519,1],[520,0,520,1],[524,0,524,1],[525,0,525,1],[526,0,526,1],[527,0,527,1],[534,0,534,4],[535,0,535,1],[536,0,536,1],[537,0,537,1],[538,0,538,1],[539,0,539,1],[543,0,543,1],[544,0,544,1],[545,0,545,1],[550,0,550,1],[551,0,551,1],[552,0,552,1],[553,0,553,1],[540,0,540,1],[541,0,541,1],[542,0,542,1],[549,0,549,1],[554,0,554,1],[547,0,547,1],[548,0,548,1],[546,0,546,1],[557,0,557,1],[483,0,483,1],[555,0,555,1],[556,0,556,1],[560,0,560,4],[591,0,591,4],[584,0,584,4],[585,0,585,4],[586,0,586,4],[588,0,588,4],[589,0,589,4],[578,0,578,1],[579,0,579,1],[580,0,580,1],[582,0,582,1],[583,0,583,4],[581,0,581,1],[590,0,590,4],[567,0,567,1],[577,0,577,1],[561,0,561,4],[562,0,562,4],[563,0,563,4],[564,0,564,1],[496,0,496,1],[179,0,179,8],[144,0,144,8],[145,0,145,8],[159,0,159,8],[160,0,160,8],[161,0,161,8],[162,0,162,8],[178,0,178,8],[482,0,482,1],[494,0,494,1],[495,0,495,1],[378,0,378,8],[379,0,379,8],[329,0,329,8],[330,0,330,8],[359,0,359,8],[360,0,360,8],[327,0,327,8],[328,0,328,8],[488,0,488,1],[489,0,489,1],[493,0,493,1],[490,0,490,1],[558,0,558,1],[559,0,559,1],[568,0,568,1],[569,0,569,1],[570,0,570,1],[574,0,574,1],[575,0,575,1],[576,0,576,1],[566,0,566,1],[571,0,571,1],[572,0,572,1],[573,0,573,1],[565,0,565,1]]}
["FILTROS:","Anx:","Cant x Espacio:","Requerido:","Tipo:","Funcional:","No Funcional:","Calif:","Observaciones:"]
[{"$f":"Menu!$B$3","v":"CENTRO ESPECIALIZADO EN DIÁLISIS PERITONEAL"}]
["EQUIPAMIENTO",null,null,null,null,null,null,null,null,null,null,null,null,null,"MOBILIARIO GENERAL",null,null,null,null,null,null,null,"MOBILIARIO MEDICO",null,null,null,null,null,null,null,"EQUIPAMIENTO GENERAL",null,null,null,null,null,null,null,"EQUIPAMIENTO MEDICO",null,null,null,null,null,null,null,"TOTAL MOBILIARIO GENERAL",null,null,null,null,null,null,null,"TOTAL MOBILIARIO MEDICO",null,null,null,null,null,null,null,"TOTAL EQUIPAMIENTO GENERAL",null,null,null,null,null,null,null,"TOTAL EQUIPAMIENTO MEDICO"]
["SERVICIO DE ADMISIÓN Y CONSULTA EXTERNA",null,null,null,null,null,null,null,null,null,null,null,null,null,null,null,null,null,null,null,null,null,null,null,null,null,null,null,null,null,null,null,null,null,null,null,null,null,null,null,null,null,null,null,null,null,{"$f":"SUM(O5:O98)","v":430},{"$f":"SUM(P5:P98)","v":0},{"$f":"SUM(Q5:Q98)","v":10},0,0,0,{"$f":"SUM(U5:U98)","v":0},0,{"$f":"SUM(W5:W98)","v":10},0,0,0,0,0,0,0,60,0,0,0,0,0,0,0,100,0,0,0,0,0,0,0]
["CONSULTA EXTERNA",null,null,null,null,null,null,null,null,null,null,null,null,null,null,null,null,null,null,null,null,null,null,null,null,null,null,null,null,null,null,null,null,null,null,null,null,null,null,null,null,null,null,null,null,null,{"$f":"SUM(O6:O98)","v":430},{"$f":"SUM(P6:P98)","v":0},{"$f":"SUM(Q6:Q98)","v":10},0,0,0,0,0,10,0,0,0,0,0,0,0,60,0,0,0,0,0,0,0,100,0,0,0,0,0,0,0]
["ADMISIÓN Y CONTROL",null,null,null,null,null,null,null,null,null,null,null,null,null,null,null,null,null,null,null,null,null,null,null,null,null,null,null,null,null,null,null,null,null,null,null,null,null,null,null,null,null,null,null,null,null,{"$f":"SUM(O7:O29)","v":160},{"$f":"SUM(P7:P29)","v":0},0,0,0,0,0,0,{"$f":"SUM(W7:W29)","v":0},0,0,0,0,{"$f":"SUM(AB7:AB29)","v":0},{"$f":"SUM(AC7:AC29)","v":0},{"$f":"SUM(AD7:AD29)","v":0},{"$f":"SUM(AE7:AE29)","v":30},{"$f":"SUM(AF7:AF29)","v":0},{"$f":"SUM(AG7:AG29)","v":0},{"$f":"SUM(AH7:AH29)","v":0},0,{"$f":"SUM(AJ7:AJ29)","v":0},{"$f":"SUM(AK7:AK29)","v":0},{"$f":"SUM(AL7:AL29)","v":0},0,{"$f":"SUM(AN7:AN29)","v":0},{"$f":"SUM(AO7:AO29)","v":0},{"$f":"SUM(AP7:AP29)","v":0},{"$f":"SUM(AQ7:AQ29)","v":0},{"$f":"SUM(AR7:AR29)","v":0},{"$f":"SUM(AS7:AS29)","v":0},{"$f":"SUM(AT7:AT29)","v":0}]
["AMBIENTES",null,null,null,null,null,null,null,null,null,null,null,null,null,null,null,null,null,null,null,null,null,null,null,null,null,null,null,null,null,null,null,null,null,null,null,null,null,null,null,null,null,null,null,null,null,{"$f":"SUM(O8:O29)","v":160},{"$f":"SUM(P8:P29)","v":0},0,0,0,0,{"$f":"SUM(U8:U29)","v":0},{"$f":"SUM(V8:V29)","v":0},{"$f":"SUM(W8:W29)","v":0},{"$f":"SUM(X8:X29)","v":0},0,{"$f":"SUM(Z8:Z29)","v":0},{"$f":"SUM(AA8:AA29)","v":0},{"$f":"SUM(AB8:AB29)","v":0},{"$f":"SUM(AC8:AC29)","v":0},0,{"$f":"SUM(AE8:AE29)","v":30},{"$f":"SUM(AF8:AF29)","v":0},{"$f":"SUM(AG8:AG29)","v":0},{"$f":"SUM(AH8:AH29)","v":0},0,{"$f":"SUM(AJ8:AJ29)","v":0},{"$f":"SUM(AK8:AK29)","v":0},{"$f":"SUM(AL8:AL29)","v":0},{"$f":"SUM(AM8:AM29)","v":0},0,{"$f":"SUM(AO8:AO29)","v":0},{"$f":"SUM(AP8:AP29)","v":0},{"$f":"SUM(AQ8:AQ29)","v":0},{"$f":"SUM(AR8:AR29)","v":0},0,{"$f":"SUM(AT8:AT29)","v":0}]
["Baterías Sanitarias",{"$f":"B1","v":"Anx:"},{"$f":"C$1","v":"Cant x Espacio:"},"Requerido:","Tipo:","Funcional:","No Funcional:","Calif:","Observaciones:",{"$f":"Infraestructura!$F$8","v":0}]
["Dosificador de jabón",null,1,{"$f":"J8*C9","v":0},"Requerido",0,0,{"$f":"IF(AND(F9>=D9,F9>0,D9>0),10,0)","v":0},null,null,"MG",null,null,null,{"$f":"IF(UPPER(E9)=\"REQUERIDO\", 10, \"\")","v":10},{"$f":"IF(UPPER(E9)=\"REQUERIDO\", H9, \"\")","v":0}]
["Dispensador de papel toalla",null,1,{"$f":"J8*C10","v":0},"Requerido",0,0,0,null,null,"MG",null,null,null,{"$f":"IF(UPPER(E10)=\"REQUERIDO\", 10, \"\")","v":10},{"$f":"IF(UPPER(E10)=\"REQUERIDO\", H10, \"\")","v":0}]
["Dispensador de papel higiénico",null,1,{"$f":"J8*C11","v":0},"Requerido",0,0,0,null,null,"MG",null,null,null,10,0]
["Espejo empotrado ",null,1,{"$f":"J8*C12","v":0},"Requerido",0,0,0,null,null,"MG",null,null,null,10,0]
["Gancho doble",null,1,{"$f":"J8*C13","v":0},"Requerido",0,0,0,null,null,"MG",null,null,null,10,0]
["Juego de ayudas técnicas",null,1,{"$f":"J8*C14","v":0},"Requerido",0,0,0,null,null,"MG",null,null,null,10,0]
["Lavabo ",null,1,{"$f":"J8*C15","v":0},"Requerido",0,0,0,null,null,"MG",null,null,null,10,0]
["Basurero con tapa y/o pedal",null,1,{"$f":"J8*C16","v":0},"Requerido",0,0,0,null,null,"MG",null,null,null,10,0]
["Recepción Admisión",{"$f":"B1","v":"Anx:"},{"$f":"C$1","v":"Cant x Espacio:"},"Requerido:","Tipo:","Funcional:","No Funcional:","Calif:","Observaciones:",{"$f":"Infraestructura!$F$9","v":0}]
["Mostrador","DIA_EQ_01",1,{"$f":"J17*C18","v":0},"Requerido",0,0,{"$f":"IF(AND(F18>=D18,F18>0,D18>0),10,0)","v":0},null,null,"MG",null,null,null,{"$f":"IF(UPPER(E18)=\"REQUERIDO\", 10, \"\")","v":10},{"$f":"IF(UPPER(E18)=\"REQUERIDO\", H18, \"\")","v":0}]
["Archivador",null,1,{"$f":"J17*C19","v":0},"Requerido",0,0,0,null,null,"MG",null,null,null,10,0]
["Computador completo PC /Computador Portátil","DIA_EQ_02",1,{"$f":"J17*C20","v":0},"Requerido",0,0,0,null,null,"EG",null,null,null,null,null,null,null,null,null,null,null,null,null,null,null,null,null,null,null,{"$f":"IF(UPPER(E20)=\"REQUERIDO\", 10, \"\")","v":10},{"$f":"IF(UPPER(E20)=\"REQUERIDO\", H20, \"\")","v":0}]
["Basurero con tapa y/o pedal",null,1,{"$f":"J17*C21","v":0},"Requerido",0,0,0,null,null,"MG",null,null,null,{"$f":"IF(UPPER(E21)=\"REQUERIDO\", 10, \"\")","v":10},{"$f":"IF(UPPER(E21)=\"REQUERIDO\", H21, \"\")","v":0}]
["Silla",null,1,{"$f":"J17*C22","v":0},"Requerido",0,0,0,null,null,"MG",null,null,null,10,0]
["Tablero de avisos ",null,1,{"$f":"J17*C23","v":0},"Requerido",0,0,0,null,null,"MG",null,null,null,10,0]
["Teléfono",null,1,{"$f":"J17*C24","v":0},"Requerido",0,0,0,null,null,"EG",null,null,null,null,null,null,null,null,null,null,null,null,null,null,null,null,null,null,null,{"$f":"IF(UPPER(E24)=\"REQUERIDO\", 10, \"\")","v":10},{"$f":"IF(UPPER(E24)=\"REQUERIDO\", H24, \"\")","v":0}]
["Sala de Espera",{"$f":"B1","v":"Anx:"},{"$f":"C$1","v":"Cant x Espacio:"},"Requerido:","Tipo:","Funcional:","No Funcional:","Calif:","Observaciones:",{"$f":"Infraestructura!$F$10","v":0}]
["Bancas / individuales/3 puestos/ 4 puestos",null,3,{"$f":"J25*C26","v":0},"Requerido",0,0,{"$f":"IF(AND(F26>=D26,F26>0,D26>0),10,0)","v":0},null,null,"MG",null,null,null,{"$f":"IF(UPPER(E26)=\"REQUERIDO\", 10, \"\")","v":10},{"$f":"IF(UPPER(E26)=\"REQUERIDO\", H26, \"\")","v":0}]
["Basurero con tapa y/o pedal",null,1,{"$f":"J25*C27","v":0},"Requerido",0,0,{"$f":"IF(AND(F27>=D27,F27>0,D27>0),10,0)","v":0},null,null,"MG",null,null,null,10,0]
["Reloj de pared",null,1,{"$f":"J25*C28","v":0},"Requerido",0,0,{"$f":"IF(AND(F28>=D28,F28>0,D28>0),10,0)","v":0},null,null,"MG",null,null,null,10,0]
["Sistema Audiovisual de Información","DIA_EQ_03",1,{"$f":"J25*C29","v":0},"Requerido",0,0,{"$f":"IF(AND(F29>=D29,F29>0,D29>0),10,0)","v":0},null,null,"EG",null,null,null,null,null,null,null,null,null,null,null,null,null,null,null,null,null,null,null,{"$f":"IF(UPPER(E29)=\"REQUERIDO\", 10, \"\")","v":10},{"$f":"IF(UPPER(E29)=\"REQUERIDO\", H29, \"\")","v":0}]
["AREA DE PACIENTE",null,null,null,null,null,null,null,null,null,null,null,null,null,null,null,null,null,null,null,null,null,null,null,null,null,null,null,null,null,null,null,null,null,null,null,null,null,null,null,null,null,null,null,null,null,{"$f":"SUM(O30:O98)","v":270},{"$f":"SUM(P30:P98)","v":0},{"$f":"SUM(Q30:Q98)","v":10},{"$f":"SUM(R30:R98)","v":0},0,0,0,0,10,0,0,0,0,0,0,0,30,0,0,0,0,0,0,0,100,0,0,0,0,0,0,0]
["AMBIENTES",null,null,null,null,null,null,null,null,null,null,null,null,null,null,null,null,null,null,null,null,null,null,null,null,null,null,null,null,null,null,null,null,null,null,null,null,null,null,null,null,null,null,null,null,null,{"$f":"SUM(O32:O98)","v":270},{"$f":"SUM(P32:P98)","v":0},{"$f":"SUM(Q32:Q98)","v":10},0,0,0,0,0,10,0,0,0,0,0,0,0,30,0,0,0,0,0,0,0,100,0,0,0,0,0,0,0]
["Consultorio de Enfermería con Lavabo. (Se convertirá en REQUERIDO cuando exista 5 Consultorios Médicos)",{"$f":"B1","v":"Anx:"},{"$f":"C$1","v":"Cant x Espacio:"},"Requerido:","Tipo:","Funcional:","No Funcional:","Calif:","Observaciones:",{"$f":"Infraestructura!F16","v":0}]
["Mesa de despacho con ala para ordenador","DIA_EQ_01",1,{"$f":"$J$32*C33","v":0},{"$f":"IF(D33>0, \"Requerido\", \"Sin Infraestructura\")","v":"Sin Infraestructura"},0,0,{"$f":"IF(AND(F33>=D33,F33>0,D33>0),10,0)","v":0},null,null,"MG",null,null,null,{"$f":"IF(UPPER(E33)=\"REQUERIDO\", 10, \"\")","v":""},{"$f":"IF(UPPER(E33)=\"REQUERIDO\", H33, \"\")","v":""}]
["Computador completo PC /Computador Portátil","DIA_EQ_02",1,{"$f":"$J$32*C34","v":0},{"$f":"IF(D34>0, \"Requerido\", \"Sin Infraestructura\")","v":"Sin Infraestructura"},0,0,0,null,null,"EG",null,null,null,null,null,null,null,null,null,null,null,null,null,null,null,null,null,null,null,{"$f":"IF(UPPER(E34)=\"REQUERIDO\", 10, \"\")","v":""},{"$f":"IF(UPPER(E34)=\"REQUERIDO\", H34, \"\")","v":""}]
["Armario vitrina",null,1,{"$f":"$J$32*C35","v":0},{"$f":"IF(D35>0, \"Requerido\", \"Sin Infraestructura\")","v":"Sin Infraestructura"},0,0,{"$f":"IF(AND(F35>=D35,F35>0,D35>0),10,0)","v":0},null,null,"MG",null,null,null,{"$f":"IF(UPPER(E35)=\"REQUERIDO\", 10, \"\")","v":""},{"$f":"IF(UPPER(E35)=\"REQUERIDO\", H35, \"\")","v":""}]
["Báscula  + tallimetro",null,1,0,"Sin Infraestructura",0,0,0,null,null,"EM",null,null,null,null,null,null,null,null,null,null,null,null,null,null,null,null,null,null,null,null,null,null,null,null,null,null,null,{"$f":"IF(UPPER(E36)=\"REQUERIDO\", 10, \"\")","v":""},{"$f":"IF(UPPER(E36)=\"REQUERIDO\", H36, \"\")","v":""}]
["Basurero con tapa y/o pedal",null,1,0,"Sin Infraestructura",0,0,0,null,null,"MG",null,null,null,{"$f":"IF(UPPER(E37)=\"REQUERIDO\", 10, \"\")","v":""},{"$f":"IF(UPPER(E37)=\"REQUERIDO\", H37, \"\")","v":""}]
["Camilla de exploración",null,1,0,"Sin Infraestructura",0,0,0,null,null,"MM",null,null,null,null,null,null,null,null,null,null,null,{"$f":"IF(UPPER(E38)=\"REQUERIDO\", 10, \"\")","v":""},{"$f":"IF(UPPER(E38)=\"REQUERIDO\", H38, \"\")","v":""}]
["Coche de curaciones ","DIA_EQ_04",1,0,"Sin Infraestructura",0,0,0,null,null,"MM",null,null,null,null,null,null,null,null,null,null,null,{"$f":"IF(UPPER(E39)=\"REQUERIDO\", 10, \"\")","v":""},""]
["Paquete de Lencería Básica","DIA_EQ_09",1,0,"Sin Infraestructura",0,0,0,null,null,"EM",null,null,null,null,null,null,null,null,null,null,null,null,null,null,null,null,null,null,null,null,null,null,null,null,null,null,null,{"$f":"IF(UPPER(E40)=\"REQUERIDO\", 10, \"\")","v":""},{"$f":"IF(UPPER(E40)=\"REQUERIDO\", H40, \"\")","v":""}]
["Coche multi propósito ",null,1,0,"Sin Infraestructura",0,0,0,null,null,"MM",null,null,null,null,null,null,null,null,null,null,null,{"$f":"IF(UPPER(E41)=\"REQUERIDO\", 10, \"\")","v":""},{"$f":"IF(UPPER(E41)=\"REQUERIDO\", H41, \"\")","v":""}]
["Dispensador de papel toalla",null,1,0,"Sin Infraestructura",0,0,0,null,null,"MG",null,null,null,{"$f":"IF(UPPER(E42)=\"REQUERIDO\", 10, \"\")","v":""},{"$f":"IF(UPPER(E42)=\"REQUERIDO\", H42, \"\")","v":""}]
["Dosificador de jabón",null,1,0,"Sin Infraestructura",0,0,0,null,null,"MG",null,null,null,"",""]
["Lavabo",null,1,0,"Sin Infraestructura",0,0,0,null,null,"MG",null,null,null,"",""]
["Escabel ",null,1,0,"Sin Infraestructura",0,0,0,null,null,"MG",null,null,null,"",""]
["Estetoscopio",null,1,0,"Sin Infraestructura",0,0,0,null,null,"EM",null,null,null,null,null,null,null,null,null,null,null,null,null,null,null,null,null,null,null,null,null,null,null,null,null,null,null,{"$f":"IF(UPPER(E46)=\"REQUERIDO\", 10, \"\")","v":""},{"$f":"IF(UPPER(E46)=\"REQUERIDO\", H46, \"\")","v":""}]
["Tensiómetro ",null,1,0,"Sin Infraestructura",0,0,0,null,null,"EM",null,null,null,null,null,null,null,null,null,null,null,null,null,null,null,null,null,null,null,null,null,null,null,null,null,null,null,"",""]
["Lámpara de cuello de ganso",null,1,0,"Sin Infraestructura",0,0,0,null,null,"MM",null,null,null,null,null,null,null,null,null,null,null,{"$f":"IF(UPPER(E48)=\"REQUERIDO\", 10, \"\")","v":""},{"$f":"IF(UPPER(E48)=\"REQUERIDO\", H48, \"\")","v":""}]
["Mueble con puertas bajas y estanterías",null,1,0,"Sin Infraestructura",0,0,0,null,null,"MG",null,null,null,{"$f":"IF(UPPER(E49)=\"REQUERIDO\", 10, \"\")","v":""},{"$f":"IF(UPPER(E49)=\"REQUERIDO\", H49, \"\")","v":""}]
["Set de desechos","DIA_EQ_06",1,0,"Sin Infraestructura",0,0,0,null,null,"MG",null,null,null,"",""]
["Silla confidente",null,2,0,"Sin Infraestructura",0,0,0,null,null,"MG",null,null,null,"",""]
["Silla",null,1,0,"Sin Infraestructura",0,0,0,null,null,"MG",null,null,null,"",""]
["Consultorio Medico con Lavabo",{"$f":"B1","v":"Anx:"},{"$f":"C$1","v":"Cant x Espacio:"},"Requerido:","Tipo:","Funcional:","No Funcional:","Calif:","Observaciones:",{"$f":"Infraestructura!$F$17","v":0}]
["Mesa de despacho con ala para ordenador","DIA_EQ_01",1,{"$f":"$J$53*C54","v":0},"Requerido",0,0,{"$f":"IF(AND(F54>=D54,F54>0,D54>0),10,0)","v":0},null,null,"MG",null,null,null,{"$f":"IF(UPPER(E54)=\"REQUERIDO\", 10, \"\")","v":10},{"$f":"IF(UPPER(E54)=\"REQUERIDO\", H54, \"\")","v":0}]
["Computador completo PC /Computador Portátil","DIA_EQ_02",1,{"$f":"$J$53*C55","v":0},"Requerido",0,0,0,null,null,"EG",null,null,null,null,null,null,null,null,null,null,null,null,null,null,null,null,null,null,null,{"$f":"IF(UPPER(E55)=\"REQUERIDO\", 10, \"\")","v":10},{"$f":"IF(UPPER(E55)=\"REQUERIDO\", H55, \"\")","v":0}]
["Armario vitrina",null,1,{"$f":"$J$53*C56","v":0},"Requerido",0,0,{"$f":"IF(AND(F56>=D56,F56>0,D56>0),10,0)","v":0},null,null,"MG",null,null,null,{"$f":"IF(UPPER(E56)=\"REQUERIDO\", 10, \"\")","v":10},{"$f":"IF(UPPER(E56)=\"REQUERIDO\", H56, \"\")","v":0}]
["Báscula  + tallimetro",null,1,0,"Requerido",0,0,0,null,null,"EM",null,null,null,null,null,null,null,null,null,null,null,null,null,null,null,null,null,null,null,null,null,null,null,null,null,null,null,{"$f":"IF(UPPER(E57)=\"REQUERIDO\", 10, \"\")","v":10},{"$f":"IF(UPPER(E57)=\"REQUERIDO\", H57, \"\")","v":0}]
["Camilla de exploración",null,1,0,"Requerido",0,0,0,null,null,"MG",null,null,null,{"$f":"IF(UPPER(E58)=\"REQUERIDO\", 10, \"\")","v":10},{"$f":"IF(UPPER(E58)=\"REQUERIDO\", H58, \"\")","v":0}]
["Equipo ó Centro de diagnostico mural o portable","DIA_EQ_05",1,0,"Requerido",0,0,0,null,null,"EM",null,null,null,null,null,null,null,null,null,null,null,null,null,null,null,null,null,null,null,null,null,null,null,null,null,null,null,{"$f":"IF(UPPER(E59)=\"REQUERIDO\", 10, \"\")","v":10},{"$f":"IF(UPPER(E59)=\"REQUERIDO\", H59, \"\")","v":0}]
["Coche de curaciones ","DIA_EQ_04",1,0,"Opcional",0,0,0,null,null,"MG",null,null,null,null,null,{"$f":"IF(UPPER(E60)=\"OPCIONAL\", 10, \"\")","v":10},{"$f":"IF(UPPER(E60)=\"OPCIONAL\", H60, \"\")","v":0}]
["Dispensador de papel toalla",null,1,0,"Requerido",0,0,0,null,null,"MG",null,null,null,{"$f":"IF(UPPER(E61)=\"REQUERIDO\", 10, \"\")","v":10},{"$f":"IF(UPPER(E61)=\"REQUERIDO\", H61, \"\")","v":0}]
["Dosificador de jabón",null,1,0,"Requerido",0,0,0,null,null,"MG",null,null,null,10,0]
["Lavabo",null,1,0,"Requerido",0,0,0,null,null,"EG",null,null,null,null,null,null,null,null,null,null,null,null,null,null,null,null,null,null,null,{"$f":"IF(UPPER(E63)=\"REQUERIDO\", 10, \"\")","v":10},{"$f":"IF(UPPER(E63)=\"REQUERIDO\", H63, \"\")","v":0}]
["Escabel  ",null,1,0,"Requerido",0,0,0,null,null,"MG",null,null,null,{"$f":"IF(UPPER(E64)=\"REQUERIDO\", 10, \"\")","v":10},{"$f":"IF(UPPER(E64)=\"REQUERIDO\", H64, \"\")","v":0}]
["Tensiómetro",null,1,0,"Requerido",0,0,0,null,null,"EM",null,null,null,null,null,null,null,null,null,null,null,null,null,null,null,null,null,null,null,null,null,null,null,null,null,null,null,{"$f":"IF(UPPER(E65)=\"REQUERIDO\", 10, \"\")","v":10},{"$f":"IF(UPPER(E65)=\"REQUERIDO\", H65, \"\")","v":0}]
["Estetoscopio",null,1,0,"Requerido",0,0,0,null,null,"EM",null,null,null,null,null,null,null,null,null,null,null,null,null,null,null,null,null,null,null,null,null,null,null,null,null,null,null,10,0]
["Negatoscopio",null,1,0,"Requerido",0,0,0,null,null,"EM",null,null,null,null,null,null,null,null,null,null,null,null,null,null,null,null,null,null,null,null,null,null,null,null,null,null,null,10,0]
["Lámpara de cuello de ganso",null,1,0,"Requerido",0,0,0,null,null,"MM",null,null,null,null,null,null,null,null,null,null,null,{"$f":"IF(UPPER(E68)=\"REQUERIDO\", 10, \"\")","v":10},{"$f":"IF(UPPER(E68)=\"REQUERIDO\", H68, \"\")","v":0}]
["Saturador de Oxígeno",null,1,0,"Requerido",0,0,0,null,null,"EM",null,null,null,null,null,null,null,null,null,null,null,null,null,null,null,null,null,null,null,null,null,null,null,null,null,null,null,{"$f":"IF(UPPER(E69)=\"REQUERIDO\", 10, \"\")","v":10},{"$f":"IF(UPPER(E69)=\"REQUERIDO\", H69, \"\")","v":0}]
["Set de desechos","DIA_EQ_06",1,0,"Requerido",0,0,0,null,null,"MG",null,null,null,{"$f":"IF(UPPER(E70)=\"REQUERIDO\", 10, \"\")","v":10},{"$f":"IF(UPPER(E70)=\"REQUERIDO\", H70, \"\")","v":0}]
["Silla confidente",null,2,0,"Requerido",0,0,0,null,null,"MG",null,null,null,10,0]
["Silla",null,1,0,"Requerido",0,0,0,null,null,"MG",null,null,null,10,0]
["Consultorio Psicología",{"$f":"B1","v":"Anx:"},{"$f":"C$1","v":"Cant x Espacio:"},"Requerido:","Tipo:","Funcional:","No Funcional:","Calif:","Observaciones:",{"$f":"Infraestructura!$F$18","v":0}]
["Mesa de despacho con ala para ordenador","DIA_EQ_01",1,{"$f":"$J$73*C74","v":0},"Requerido",0,0,{"$f":"IF(AND(F74>=D74,F74>0,D74>0),10,0)","v":0},null,null,"MG",null,null,null,{"$f":"IF(UPPER(E74)=\"REQUERIDO\", 10, \"\")","v":10},{"$f":"IF(UPPER(E74)=\"REQUERIDO\", H74, \"\")","v":0}]
["Computador completo PC /Computador Portátil","DIA_EQ_02",1,{"$f":"$J$73*C75","v":0},"Requerido",0,0,0,null,null,"EM",null,null,null,null,null,null,null,null,null,null,null,null,null,null,null,null,null,null,null,null,null,null,null,null,null,null,null,{"$f":"IF(UPPER(E75)=\"REQUERIDO\", 10, \"\")","v":10},{"$f":"IF(UPPER(E75)=\"REQUERIDO\", H75, \"\")","v":0}]
["Armario vitrina/Archivador",null,1,{"$f":"$J$73*C76","v":0},"Requerido",0,0,{"$f":"IF(AND(F76>=D76,F76>0,D76>0),10,0)","v":0},null,null,"MG",null,null,null,{"$f":"IF(UPPER(E76)=\"REQUERIDO\", 10, \"\")","v":10},{"$f":"IF(UPPER(E76)=\"REQUERIDO\", H76, \"\")","v":0}]
["Set de desechos","DIA_EQ_06",1,0,"Requerido",0,0,0,null,null,"MG",null,null,null,10,0]
["Dispensador de Gel Antiséptico",null,1,0,"Requerido",0,0,0,null,null,"MG",null,null,null,10,0]
["Silla confidente",null,2,0,"Requerido",0,0,0,null,null,"MG",null,null,null,10,0]
["Silla",null,1,0,"Requerido",0,0,0,null,null,"MG",null,null,null,10,0]
["Consultorio Trabajo Social",{"$f":"B1","v":"Anx:"},{"$f":"C$1","v":"Cant x Espacio:"},"Requerido:","Tipo:","Funcional:","No Funcional:","Calif:","Observaciones:",{"$f":"Infraestructura!$F$19","v":0}]
["Mesa de despacho con ala para ordenador","DIA_EQ_01",1,{"$f":"$J$81*C82","v":0},"Requerido",0,0,{"$f":"IF(AND(F82>=D82,F82>0,D82>0),10,0)","v":0},null,null,"MG",null,null,null,{"$f":"IF(UPPER(E82)=\"REQUERIDO\", 10, \"\")","v":10},{"$f":"IF(UPPER(E82)=\"REQUERIDO\", H82, \"\")","v":0}]
["Computador completo PC /Computador Portátil","DIA_EQ_02",1,0,"Requerido",0,0,0,null,null,"EM",null,null,null,null,null,null,null,null,null,null,null,null,null,null,null,null,null,null,null,null,null,null,null,null,null,null,null,{"$f":"IF(UPPER(E83)=\"REQUERIDO\", 10, \"\")","v":10},{"$f":"IF(UPPER(E83)=\"REQUERIDO\", H83, \"\")","v":0}]
["Armario vitrina/Archivador",null,1,0,"Requerido",0,0,{"$f":"IF(AND(F84>=D84,F84>0,D84>0),10,0)","v":0},null,null,"MG",null,null,null,{"$f":"IF(UPPER(E84)=\"REQUERIDO\", 10, \"\")","v":10},{"$f":"IF(UPPER(E84)=\"REQUERIDO\", H84, \"\")","v":0}]
["Basurero con tapa y/o pedal",null,1,0,"Requerido",0,0,0,null,null,"MG",null,null,null,10,0]
["Dispensador de Gel Antiséptico",null,1,0,"Requerido",0,0,0,null,null,"MG",null,null,null,10,0]
["Silla confidente",null,2,0,"Requerido",0,0,0,null,null,"MG",null,null,null,10,0]
["Silla",null,1,0,"Requerido",0,0,{"$f":"IF(AND(F88>=D88,F88>0,D88>0),10,0)","v":0},null,null,"MG",null,null,null,{"$f":"IF(UPPER(E88)=\"REQUERIDO\", 10, \"\")","v":10},{"$f":"IF(UPPER(E88)=\"REQUERIDO\", H88, \"\")","v":0}]
["Consultorio Nutrición",{"$f":"B1","v":"Anx:"},{"$f":"C$1","v":"Cant x Espacio:"},"Requerido:","Tipo:","Funcional:","No Funcional:","Calif:","Observaciones:",{"$f":"Infraestructura!$F$20","v":0}]
["Mesa de despacho con ala para ordenador","DIA_EQ_01",1,{"$f":"$J$89*C90","v":0},"Requerido",0,0,{"$f":"IF(AND(F90>=D90,F90>0,D90>0),10,0)","v":0},null,null,"MG",null,null,null,{"$f":"IF(UPPER(E90)=\"REQUERIDO\", 10, \"\")","v":10},{"$f":"IF(UPPER(E90)=\"REQUERIDO\", H90, \"\")","v":0}]
["Computador completo PC /Computador Portátil","DIA_EQ_02",1,{"$f":"$J$89*C91","v":0},"Requerido",0,0,{"$f":"IF(AND(F91>=D91,F91>0,D91>0),10,0)","v":0},null,null,"EG",null,null,null,null,null,null,null,null,null,null,null,null,null,null,null,null,null,null,null,{"$f":"IF(UPPER(E91)=\"REQUERIDO\", 10, \"\")","v":10},{"$f":"IF(UPPER(E91)=\"REQUERIDO\", H91, \"\")","v":0}]
["Armario vitrina/Archivador",null,1,{"$f":"$J$89*C92","v":0},"Requerido",0,0,{"$f":"IF(AND(F92>=D92,F92>0,D92>0),10,0)","v":0},null,null,"MG",null,null,null,{"$f":"IF(UPPER(E92)=\"REQUERIDO\", 10, \"\")","v":10},{"$f":"IF(UPPER(E92)=\"REQUERIDO\", H92, \"\")","v":0}]
["Plicometro",null,1,{"$f":"$J$89*C93","v":0},"Requerido",0,0,{"$f":"IF(AND(F93>=D93,F93>0,D93>0),10,0)","v":0},null,null,"EM",null,null,null,null,null,null,null,null,null,null,null,null,null,null,null,null,null,null,null,null,null,null,null,null,null,null,null,{"$f":"IF(UPPER(E93)=\"REQUERIDO\", 10, \"\")","v":10},{"$f":"IF(UPPER(E93)=\"REQUERIDO\", H93, \"\")","v":0}]
["Báscula  + tallimetro",null,1,{"$f":"$J$89*C94","v":0},"Requerido",0,0,{"$f":"IF(AND(F94>=D94,F94>0,D94>0),10,0)","v":0},null,null,"EM",null,null,null,null,null,null,null,null,null,null,null,null,null,null,null,null,null,null,null,null,null,null,null,null,null,null,null,10,0]
["Silla confidente",null,2,{"$f":"$J$89*C95","v":0},"Requerido",0,0,{"$f":"IF(AND(F95>=D95,F95>0,D95>0),10,0)","v":0},null,null,"MG",null,null,null,{"$f":"IF(UPPER(E95)=\"REQUERIDO\", 10, \"\")","v":10},{"$f":"IF(UPPER(E95)=\"REQUERIDO\", H95, \"\")","v":0}]
["Silla",null,1,{"$f":"$J$89*C96","v":0},"Requerido",0,0,{"$f":"IF(AND(F96>=D96,F96>0,D96>0),10,0)","v":0},null,null,"MG",null,null,null,10,0]
["Set de desechos","DIA_EQ_06",1,{"$f":"$J$89*C97","v":0},"Requerido",0,0,{"$f":"IF(AND(F97>=D97,F97>0,D97>0),10,0)","v":0},null,null,"MG",null,null,null,10,0]
["Dispensador de Gel Antiséptico",null,1,{"$f":"$J$89*C98","v":0},"Requerido",0,0,0,null,null,"MG",null,null,null,10,0]
["SERVICIO DE DIÁLISIS PERITONEAL",null,null,null,null,null,null,null,null,null,null,null,null,null,null,null,null,null,null,null,null,null,null,null,null,null,null,null,null,null,null,null,null,null,null,null,null,null,null,null,null,null,null,null,null,null,{"$f":"SUM(O100:O159)","v":140},{"$f":"SUM(P100:P159)","v":0},{"$f":"SUM(Q100:Q159)","v":10},{"$f":"SUM(R100:R159)","v":0},10,0,0,0,0,0,0,0,0,0,0,0,10,0,10,0,0,0,0,0,0,0,0,0,0,0,0,0]
["ÁREA DE PROCEDIMIENTO  DE DIÁLISIS PERITONEAL",null,null,null,null,null,null,null,null,null,null,null,null,null,null,null,null,null,null,null,null,null,null,null,null,null,null,null,null,null,null,null,null,null,null,null,null,null,null,null,null,null,null,null,null,null,{"$f":"SUM(O100:O131)","v":0},{"$f":"SUM(P100:P131)","v":0},{"$f":"SUM(Q100:Q131)","v":0},0,10,{"$f":"SUM(T100:T131)","v":0},0,0,{"$f":"SUM(W100:W131)","v":0},0,0,{"$f":"SUM(Z100:Z131)","v":0},0,0,{"$f":"SUM(AC100:AC131)","v":0},0,0,{"$f":"SUM(AF100:AF131)","v":0},0,0,{"$f":"SUM(AI100:AI131)","v":0},0,0,{"$f":"SUM(AL100:AL131)","v":0},0,0,{"$f":"SUM(AO100:AO131)","v":0},0,0,{"$f":"SUM(AR100:AR131)","v":0},0,0]
["ÁREA DE TRATAMIENTO",null,null,null,null,null,null,null,null,null,null,null,null,null,null,null,null,null,null,null,null,null,null,null,null,null,null,null,null,null,null,null,null,null,null,null,null,null,null,null,null,null,null,null,null,null,{"$f":"SUM(O101:O131)","v":0},{"$f":"SUM(P101:P131)","v":0},{"$f":"SUM(Q101:Q131)","v":0},0,10,{"$f":"SUM(T101:T131)","v":0},0,0,{"$f":"SUM(W101:W131)","v":0},0,0,{"$f":"SUM(Z101:Z131)","v":0},0,0,{"$f":"SUM(AC101:AC131)","v":0},0,0,{"$f":"SUM(AF101:AF131)","v":0},0,0,{"$f":"SUM(AI101:AI131)","v":0},0,0,{"$f":"SUM(AL101:AL131)","v":0},0,0,{"$f":"SUM(AO101:AO131)","v":0},0,0,{"$f":"SUM(AR101:AR131)","v":0},0,0]
["AMBIENTES",null,null,null,null,null,null,null,null,null,null,null,null,null,null,null,null,null,null,null,null,null,null,null,null,null,null,null,null,null,null,null,null,null,null,null,null,null,null,null,null,null,null,null,null,null,{"$f":"SUM(O103:O126)","v":0},{"$f":"SUM(P103:P126)","v":0},{"$f":"SUM(Q103:Q126)","v":0},0,10,{"$f":"SUM(T103:T126)","v":0},0,0,{"$f":"SUM(W103:W126)","v":0},0,0,{"$f":"SUM(Z103:Z126)","v":0},0,0,{"$f":"SUM(AC103:AC126)","v":0},0,0,{"$f":"SUM(AF103:AF126)","v":0},0,0,{"$f":"SUM(AI103:AI126)","v":0},0,0,{"$f":"SUM(AL103:AL126)","v":0},0,0,{"$f":"SUM(AO103:AO126)","v":0},0,0,{"$f":"SUM(AR103:AR126)","v":0},0,0]
["Sala de procedimientos - Debe existir acuerdo con una unidad quirúrgica para realización, reparación de Fístulas y colocación de Catéteres en caso de no haber  convenio se hará requerido",{"$f":"B1","v":"Anx:"},{"$f":"C$1","v":"Cant x Espacio:"},"Requerido:","Tipo:","Funcional:","No Funcional:","Calif:","Observaciones:",{"$f":"Infraestructura!F28","v":0}]
["Camilla de exploración,  2 cuerpos ",null,1,{"$f":"$J$103*C104","v":0},{"$f":"IF(D104>0, \"Requerido\", \"Sin Infraestructura\")","v":"Sin Infraestructura"},0,0,{"$f":"IF(AND(F104>=D104,F104>0,D104>0),10,0)","v":0},null,null,"MM",null,null,null,null,null,null,null,null,null,null,null,{"$f":"IF(UPPER(E104)=\"REQUERIDO\", 10, \"\")","v":""},{"$f":"IF(UPPER(E104)=\"REQUERIDO\", H104, \"\")","v":""}]
["Porta sueros",null,1,{"$f":"$J$103*C105","v":0},"Sin Infraestructura",0,0,0,null,null,"EM",null,null,null,null,null,null,null,null,null,null,null,null,null,null,null,null,null,null,null,null,null,null,null,null,null,null,null,{"$f":"IF(UPPER(E105)=\"REQUERIDO\", 10, \"\")","v":""},{"$f":"IF(UPPER(E105)=\"REQUERIDO\", H105, \"\")","v":""}]
["Tensiómetro",null,1,0,"Sin Infraestructura",0,0,0,null,null,"EM",null,null,null,null,null,null,null,null,null,null,null,null,null,null,null,null,null,null,null,null,null,null,null,null,null,null,null,"",""]
["Estetoscopio",null,1,0,"Sin Infraestructura",0,0,0,null,null,"EM",null,null,null,null,null,null,null,null,null,null,null,null,null,null,null,null,null,null,null,null,null,null,null,null,null,null,null,"",""]
["Coche de paro completo  ","DIA_EQ_08",1,0,"Sin Infraestructura",0,0,0,null,null,"EM",null,null,null,null,null,null,null,null,null,null,null,null,null,null,null,null,null,null,null,null,null,null,null,null,null,null,null,"",""]
["Desfibrilador",null,1,0,"Sin Infraestructura",0,0,0,null,null,"EM",null,null,null,null,null,null,null,null,null,null,null,null,null,null,null,null,null,null,null,null,null,null,null,null,null,null,null,"",""]
["Electrocardiógrafo",null,1,0,"Sin Infraestructura",0,0,0,null,null,"EM",null,null,null,null,null,null,null,null,null,null,null,null,null,null,null,null,null,null,null,null,null,null,null,null,null,null,null,"",""]
["Lámpara de cuello de ganso",null,1,0,"Sin Infraestructura",0,0,0,null,null,"MM",null,null,null,null,null,null,null,null,null,null,null,{"$f":"IF(UPPER(E111)=\"REQUERIDO\", 10, \"\")","v":""},{"$f":"IF(UPPER(E111)=\"REQUERIDO\", H111, \"\")","v":""}]
["Monitor Signos Vitales NIBP,SPO2",null,1,0,"Sin Infraestructura",0,0,0,null,null,"EM",null,null,null,null,null,null,null,null,null,null,null,null,null,null,null,null,null,null,null,null,null,null,null,null,null,null,null,{"$f":"IF(UPPER(E112)=\"REQUERIDO\", 10, \"\")","v":""},{"$f":"IF(UPPER(E112)=\"REQUERIDO\", H112, \"\")","v":""}]
["Set de desechos",null,1,0,"Sin Infraestructura",0,0,0,null,null,"MG",null,null,null,{"$f":"IF(UPPER(E113)=\"REQUERIDO\", 10, \"\")","v":""},{"$f":"IF(UPPER(E113)=\"REQUERIDO\", H113, \"\")","v":""}]
["Silla",null,1,0,"Sin Infraestructura",0,0,0,null,null,"MG",null,null,null,"",""]
["Lavabo",null,1,0,"Sin Infraestructura",0,0,0,null,null,"MG",null,null,null,"",""]
["Dosificador de jabón",null,1,0,"Sin Infraestructura",0,0,0,null,null,"MG",null,null,null,"",""]
["Dispensador de papel toalla",null,1,0,"Sin Infraestructura",0,0,0,null,null,"MG",null,null,null,"",""]
["Lámpara quirúrgica básica portátil cielítica",null,1,0,"Sin Infraestructura",0,0,0,null,null,"MM",null,null,null,null,null,null,null,null,null,null,null,{"$f":"IF(UPPER(E118)=\"REQUERIDO\", 10, \"\")","v":""},{"$f":"IF(UPPER(E118)=\"REQUERIDO\", H118, \"\")","v":""}]
["Mesa de mayo , acero inoxidable.",null,1,0,"Sin Infraestructura",0,0,0,null,null,"MM",null,null,null,null,null,null,null,null,null,null,null,"",""]
["Mesa instrumental auxiliar",null,1,0,"Sin Infraestructura",0,0,0,null,null,"MM",null,null,null,null,null,null,null,null,null,null,null,"",""]
["Tomas de gases medicinales y vacío",null,1,0,"Sin Infraestructura",0,0,0,null,null,"MM",null,null,null,null,null,null,null,null,null,null,null,"",""]
["Soporte bajo rodado, una cubeta acero inoxidable  ",null,1,0,"Deseable",0,0,0,null,null,"MG",null,null,null,{"$f":"IF(UPPER(E122)=\"REQUERIDO\", 10, \"\")","v":""},{"$f":"IF(UPPER(E122)=\"REQUERIDO\", H122, \"\")","v":""},null,null,{"$f":"IF(UPPER(E122)=\"DESEABLE\", 10, 0)","v":10},{"$f":"IF(UPPER(E122)=\"DESEABLE\", H122, \"\")","v":0}]
["Set de desechos","DIA_EQ_06",1,0,{"$f":"IF(D123>0, \"Requerido\", \"Sin Infraestructura\")","v":"Sin Infraestructura"},0,0,0,null,null,"MG",null,null,null,"",""]
["Taburete bajo con respaldo, con ruedas",null,1,0,{"$f":"IF(D124>0, \"Requerido\", \"Sin Infraestructura\")","v":"Sin Infraestructura"},0,0,0,null,null,"MG",null,null,null,"",""]
["Flujómetro para O2 ",null,1,0,{"$f":"IF(D125>0, \"Requerido\", \"Sin Infraestructura\")","v":"Sin Infraestructura"},0,0,0,null,null,"MG",null,null,null,"",""]
["Vacuómetro",null,1,0,{"$f":"IF(D126>0, \"Requerido\", \"Sin Infraestructura\")","v":"Sin Infraestructura"},0,0,0,null,null,"EM",null,null,null,null,null,null,null,null,null,null,null,null,null,null,null,null,null,null,null,null,null,null,null,null,null,null,null,{"$f":"IF(UPPER(E126)=\"REQUERIDO\", 10, \"\")","v":""},{"$f":"IF(UPPER(E126)=\"REQUERIDO\", H126, \"\")","v":""}]
["Zona de  esterilización -  Se convierte en Requerido si existe la Sala de Procedimientos. Puede seguir como condición  en el caso de tener externalizado el servicio de esterilización",{"$f":"B1","v":"Anx:"},{"$f":"C$1","v":"Cant x Espacio:"},"Requerido:","Tipo:","Funcional:","No Funcional:","Calif:","Observaciones:",{"$f":"Infraestructura!F29","v":0}]
["Autoclave /Esterilizador",null,1,{"$f":"J127*C128","v":0},{"$f":"IF(D128>0, \"Requerido\", \"Sin Infraestructura\")","v":"Sin Infraestructura"},0,0,{"$f":"IF(AND(F128>=D128,F128>0,D128>0),10,0)","v":0},null,null,"EM",null,null,null,null,null,null,null,null,null,null,null,null,null,null,null,null,null,null,null,null,null,null,null,null,null,null,null,{"$f":"IF(UPPER(E128)=\"REQUERIDO\", 10, \"\")","v":""},{"$f":"IF(UPPER(E128)=\"REQUERIDO\", H128, \"\")","v":""}]
["Dispensador de papel toalla",null,1,{"$f":"J127*C129","v":0},{"$f":"IF(D129>0, \"Requerido\", \"Sin Infraestructura\")","v":"Sin Infraestructura"},0,0,{"$f":"IF(AND(F129>=D129,F129>0,D129>0),10,0)","v":0},null,null,"MG",null,null,null,{"$f":"IF(UPPER(E129)=\"REQUERIDO\", 10, \"\")","v":""},{"$f":"IF(UPPER(E129)=\"REQUERIDO\", H129, \"\")","v":""}]
["Dosificador de jabón",null,1,{"$f":"J127*C130","v":0},{"$f":"IF(D130>0, \"Requerido\", \"Sin Infraestructura\")","v":"Sin Infraestructura"},0,0,{"$f":"IF(AND(F130>=D130,F130>0,D130>0),10,0)","v":0},null,null,"MG",null,null,null,"",""]
["Mueble bajo con mesón, lavabo y puertas bajas",null,1,{"$f":"J127*C131","v":0},{"$f":"IF(D131>0, \"Requerido\", \"Sin Infraestructura\")","v":"Sin Infraestructura"},0,0,{"$f":"IF(AND(F131>=D131,F131>0,D131>0),10,0)","v":0},null,null,"MG",null,null,null,"",""]
["ÁREA DE APOYO Y APROVISONAMIENTO",null,null,null,null,null,null,null,null,null,null,null,null,null,null,null,null,null,null,null,null,null,null,null,null,null,null,null,null,null,null,null,null,null,null,null,null,null,null,null,null,null,null,null,null,null,{"$f":"SUM(O133:O159)","v":140},{"$f":"SUM(P133:P159)","v":0},{"$f":"SUM(Q133:Q159)","v":10},0,0,0,0,0,0,0,0,0,0,0,0,0,10,0,10,0,0,0,0,0,0,0,0,0,0,0,0,0]
["Esta área funcional debe estar centralizada y no debe estar en contacto con las áreas de tratamiento",null,null,null,null,null,null,null,null,null,null,null,null,null,null,null,null,null,null,null,null,null,null,null,null,null,null,null,null,null,null,null,null,null,null,null,null,null,null,null,null,null,null,null,null,null,{"$f":"SUM(O133:O144)","v":50},{"$f":"SUM(P133:P144)","v":0},{"$f":"SUM(Q133:Q144)","v":0},0,0,0,0,0,0,0,0,0,0,0,0,0,10,0,0,0,0,0,0,0,0,0,0,0,0,0,0,0]
["AMBIENTES",null,null,null,null,null,null,null,null,null,null,null,null,null,null,null,null,null,null,null,null,null,null,null,null,null,null,null,null,null,null,null,null,null,null,null,null,null,null,null,null,null,null,null,null,null,{"$f":"SUM(O135:O144)","v":50},{"$f":"SUM(P135:P144)","v":0},{"$f":"SUM(Q135:Q144)","v":0},{"$f":"SUM(R135:R144)","v":0},0,0,0,0,0,0,0,0,0,0,0,0,10,0,0,0,0,0,0,0,0,0,0,0,0,0,0,0]
["Cuarto de limpieza con vertedero",{"$f":"B1","v":"Anx:"},{"$f":"C$1","v":"Cant x Espacio:"},"Requerido:","Tipo:","Funcional:","No Funcional:","Calif:","Observaciones:",{"$f":"Infraestructura!F36","v":0}]
["Coche de limpieza","DIA_EQ_07",1,{"$f":"J135*C136","v":0},"Requerido",0,0,{"$f":"IF(AND(F136>=D136,F136>0,D136>0),10,0)","v":0},null,null,"MG",null,null,null,{"$f":"IF(UPPER(E136)=\"REQUERIDO\", 10, \"\")","v":10},{"$f":"IF(UPPER(E136)=\"REQUERIDO\", H136, \"\")","v":0}]
["Stock de Insumos de Limpieza","DIA_EQ_10",1,{"$f":"J135*C137","v":0},"Requerido",0,0,{"$f":"IF(AND(F137>=D137,F137>0,D137>0),10,0)","v":0},null,null,"EG",null,null,null,null,null,null,null,null,null,null,null,null,null,null,null,null,null,null,null,{"$f":"IF(UPPER(E137)=\"REQUERIDO\", 10, \"\")","v":10},{"$f":"IF(UPPER(E137)=\"REQUERIDO\", H137, \"\")","v":0}]
["Estantería básica",null,1,{"$f":"J135*C138","v":0},"Requerido",0,0,{"$f":"IF(AND(F138>=D138,F138>0,D138>0),10,0)","v":0},null,null,"MG",null,null,null,{"$f":"IF(UPPER(E138)=\"REQUERIDO\", 10, \"\")","v":10},{"$f":"IF(UPPER(E138)=\"REQUERIDO\", H138, \"\")","v":0}]
["Lavadero con poza profunda para el preparado y enjuague de los útiles de limpieza (vertedero/Tineta)",null,1,{"$f":"J135*C139","v":0},"Requerido",0,0,{"$f":"IF(AND(F139>=D139,F139>0,D139>0),10,0)","v":0},null,null,"MG",null,null,null,10,0]
["Almacenamiento intermedio de desechos (Se hará requerido en el caso de contar con más de 50 puestos de tratamiento)",{"$f":"B1","v":"Anx:"},{"$f":"C$1","v":"Cant x Espacio:"},"Requerido:","Tipo:","Funcional:","No Funcional:","Calif:","Observaciones:",{"$f":"Infraestructura!F37","v":0}]
["Set de desechos","DIA_EQ_06",1,{"$f":"J140*C141","v":0},{"$f":"IF(D141>0, \"Requerido\", \"Sin Infraestructura\")","v":"Sin Infraestructura"},0,0,{"$f":"IF(AND(F141>=D141,F141>0,D141>0),10,0)","v":0},null,null,"MG",null,null,null,{"$f":"IF(UPPER(E141)=\"REQUERIDO\", 10, \"\")","v":""},{"$f":"IF(UPPER(E141)=\"REQUERIDO\", H141, \"\")","v":""}]
["Lencería",{"$f":"B1","v":"Anx:"},{"$f":"C$1","v":"Cant x Espacio:"},"Requerido:","Tipo:","Funcional:","No Funcional:","Calif:","Observaciones:",{"$f":"Infraestructura!F38","v":0}]
["Estantería básica",null,1,{"$f":"J142*C143","v":0},"Requerido",0,0,{"$f":"IF(AND(F143>=D143,F143>0,D143>0),10,0)","v":0},null,null,"MG",null,null,null,{"$f":"IF(UPPER(E143)=\"REQUERIDO\", 10, \"\")","v":10},{"$f":"IF(UPPER(E143)=\"REQUERIDO\", H143, \"\")","v":0}]
["Coche de ropa limpia",null,1,{"$f":"J142*C144","v":0},"Requerido",0,0,{"$f":"IF(AND(F144>=D144,F144>0,D144>0),10,0)","v":0},null,null,"MG",null,null,null,10,0]
["ÁREA PACIENTE",null,null,null,null,null,null,null,null,null,null,null,null,null,null,null,null,null,null,null,null,null,null,null,null,null,null,null,null,null,null,null,null,null,null,null,null,null,null,null,null,null,null,null,null,null,{"$f":"SUM(O146:O159)","v":90},{"$f":"SUM(P146:P159)","v":0},{"$f":"SUM(Q146:Q159)","v":10},{"$f":"SUM(R146:R159)","v":0},0,0,0,0,0,0,0,0,0,0,0,0,0,0,10,0,0,0,0,0,0,0,0,0,0,0,0,0]
["AMBIENTES",null,null,null,null,null,null,null,null,null,null,null,null,null,null,null,null,null,null,null,null,null,null,null,null,null,null,null,null,null,null,null,null,null,null,null,null,null,null,null,null,null,null,null,null,null,{"$f":"SUM(O147:O159)","v":90},{"$f":"SUM(P147:P159)","v":0},{"$f":"SUM(Q147:Q159)","v":10},{"$f":"SUM(R147:R159)","v":0},0,0,0,0,0,0,0,0,0,0,0,0,0,0,10,0,0,0,0,0,0,0,0,0,0,0,0,0]
["Repostería",{"$f":"B1","v":"Anx:"},{"$f":"C$1","v":"Cant x Espacio:"},"Requerido:","Tipo:","Funcional:","No Funcional:","Calif:","Observaciones:",{"$f":"Infraestructura!$F$44","v":0}]
["Mueble bajo con mesón, lavabo y puertas bajas",null,1,{"$f":"J147*C148","v":0},"Opcional",0,0,{"$f":"IF(AND(F148>=D148,F148>0,D148>0),10,0)","v":0},null,null,"MG",null,null,null,null,null,{"$f":"IF(UPPER(E148)=\"OPCIONAL\", 10, \"\")","v":10},{"$f":"IF(UPPER(E148)=\"OPCIONAL\", H148, \"\")","v":0}]
["Basurero con tapa y/o pedal",null,1,{"$f":"J147*C149","v":0},"Requerido",0,0,0,null,null,"MG",null,null,null,{"$f":"IF(UPPER(E149)=\"REQUERIDO\", 10, \"\")","v":10},{"$f":"IF(UPPER(E149)=\"REQUERIDO\", H149, \"\")","v":0}]
["Dispensador de papel toalla",null,1,{"$f":"J147*C150","v":0},"Requerido",0,0,0,null,null,"MG",null,null,null,10,0]
["Dosificador de jabón",null,1,{"$f":"J147*C151","v":0},"Requerido",0,0,0,null,null,"MG",null,null,null,10,0]
["Mesa ",null,1,{"$f":"J147*C152","v":0},"Requerido",0,0,0,null,null,"MG",null,null,null,10,0]
["Refrigerador",null,1,{"$f":"J147*C153","v":0},"Opcional",0,0,0,null,null,"EG",null,null,null,null,null,null,null,null,null,null,null,null,null,null,null,null,null,null,null,null,null,{"$f":"IF(UPPER(E153)=\"OPCIONAL\", 10, \"\")","v":10},{"$f":"IF(UPPER(E153)=\"OPCIONAL\", H153, \"\")","v":0}]
["Silla",null,4,{"$f":"J147*C154","v":0},"Requerido",0,0,0,null,null,"MG",null,null,null,{"$f":"IF(UPPER(E154)=\"REQUERIDO\", 10, \"\")","v":10},{"$f":"IF(UPPER(E154)=\"REQUERIDO\", H154, \"\")","v":0}]
["Vestidor de pacientes",{"$f":"B1","v":"Anx:"},{"$f":"C$1","v":"Cant x Espacio:"},"Requerido:","Tipo:","Funcional:","No Funcional:","Calif:","Observaciones:",{"$f":"Infraestructura!$F$45","v":0}]
["Lockers",null,5,{"$f":"J155*C156","v":0},"Requerido",0,0,{"$f":"IF(AND(F156>=D156,F156>0,D156>0),10,0)","v":0},null,null,"MG",null,null,null,{"$f":"IF(UPPER(E156)=\"REQUERIDO\", 10, \"\")","v":10},{"$f":"IF(UPPER(E156)=\"REQUERIDO\", H156, \"\")","v":0}]
["Banco de vestuario",null,1,{"$f":"J155*C157","v":0},"Requerido",0,0,{"$f":"IF(AND(F157>=D157,F157>0,D157>0),10,0)","v":0},null,null,"MG",null,null,null,10,0]
["Gancho doble",null,1,{"$f":"J155*C158","v":0},"Requerido",0,0,{"$f":"IF(AND(F158>=D158,F158>0,D158>0),10,0)","v":0},null,null,"MG",null,null,null,10,0]
["Basurero con tapa y/o pedal",null,1,{"$f":"J155*C159","v":0},"Requerido",0,0,{"$f":"IF(AND(F159>=D159,F159>0,D159>0),10,0)","v":0},null,null,"MG",null,null,null,10,0]
["SERVICIO DE DIÁLISIS PERITONEAL",null,null,null,null,null,null,null,null,null,null,null,null,null,null,null,null,null,null,null,null,null,null,null,null,null,null,null,null,null,null,null,null,null,null,null,null,null,null,null,null,null,null,null,null,null,{"$f":"SUM(O161:O191)","v":80},{"$f":"SUM(P161:P191)","v":0},{"$f":"SUM(Q161:Q191)","v":0},0,0,{"$f":"SUM(T161:T191)","v":0},0,0,{"$f":"SUM(W161:W191)","v":20},0,20,{"$f":"SUM(Z161:Z191)","v":0},0,0,{"$f":"SUM(AC161:AC191)","v":0},0,10,{"$f":"SUM(AF161:AF191)","v":0},0,0,{"$f":"SUM(AI161:AI191)","v":0},0,0,{"$f":"SUM(AL161:AL191)","v":0},10,0,{"$f":"SUM(AO161:AO191)","v":0},0,0,{"$f":"SUM(AR161:AR191)","v":0},0,0]
["ÁREA DE TRATAMIENTO DE DIÁLISIS PERITONEAL",null,null,null,null,null,null,null,null,null,null,null,null,null,null,null,null,null,null,null,null,null,null,null,null,null,null,null,null,null,null,null,null,null,null,null,null,null,null,null,null,null,null,null,null,null,{"$f":"SUM(O162:O191)","v":80},{"$f":"SUM(P162:P191)","v":0},{"$f":"SUM(Q162:Q191)","v":0},0,0,0,0,0,20,0,20,0,0,0,0,0,10,0,0,0,0,0,0,0,10,0,0,0,0,0,0,0]
["ÁREA DE TRATAMIENTO ",null,null,null,null,null,null,null,null,null,null,null,null,null,null,null,null,null,null,null,null,null,null,null,null,null,null,null,null,null,null,null,null,null,null,null,null,null,null,null,null,null,null,null,null,null,{"$f":"SUM(O163:O178)","v":80},{"$f":"SUM(P163:P178)","v":0},{"$f":"SUM(Q163:Q178)","v":0},0,0,0,0,0,20,0,10,0,0,0,0,0,10,0,0,0,0,0,0,0,10,0,0,0,0,0,0,0]
["AMBIENTES",null,null,null,null,null,null,null,null,null,null,null,null,null,null,null,null,null,null,null,null,null,null,null,null,null,null,null,null,null,null,null,null,null,null,null,null,null,null,null,null,null,null,null,null,null,{"$f":"SUM(O164:O178)","v":80},{"$f":"SUM(P164:P178)","v":0},{"$f":"SUM(Q164:Q178)","v":0},{"$f":"SUM(R164:R178)","v":0},0,0,0,0,20,0,10,0,0,0,0,0,10,0,0,0,0,0,0,0,10,0,0,0,0,0,0,0]
["Sala de entrenamiento",{"$f":"B1","v":"Anx:"},{"$f":"C$1","v":"Cant x Espacio:"},"Requerido:","Tipo:","Funcional:","No Funcional:","Calif:","Observaciones:",{"$f":"Infraestructura!$F$53","v":0}]
["Silla",null,2,{"$f":"J164*C165","v":0},"Requerido",0,0,{"$f":"IF(AND(F165>=D165,F165>0,D165>0),10,0)","v":0},null,null,"MG",null,null,null,{"$f":"IF(UPPER(E165)=\"REQUERIDO\", 10, \"\")","v":10},{"$f":"IF(UPPER(E165)=\"REQUERIDO\", H165, \"\")","v":0}]
["Coche de curaciones ","DIA_EQ_04",1,{"$f":"J164*C166","v":0},"Requerido",0,0,0,null,null,"MM",null,null,null,null,null,null,null,null,null,null,null,{"$f":"IF(UPPER(E166)=\"REQUERIDO\", 10, \"\")","v":10},{"$f":"IF(UPPER(E166)=\"REQUERIDO\", H166, \"\")","v":0}]
["Mesilla",null,1,{"$f":"J164*C167","v":0},"Requerido",0,0,0,null,null,"MG",null,null,null,{"$f":"IF(UPPER(E167)=\"REQUERIDO\", 10, \"\")","v":10},{"$f":"IF(UPPER(E167)=\"REQUERIDO\", H167, \"\")","v":0}]
["Camilla / Sillón reclinable",null,1,{"$f":"J164*C168","v":0},"Opcional",0,0,0,null,null,"MM",null,null,null,null,null,null,null,null,null,null,null,null,null,{"$f":"IF(UPPER(E168)=\"OPCIONAL\", 10, 0)","v":10},{"$f":"IF(UPPER(E168)=\"OPCIONAL\", H168, \"\")","v":0}]
["Mesón con doble Lavabo  en Espejo",null,1,{"$f":"J164*C169","v":0},"Requerido",0,0,0,null,null,"MG",null,null,null,{"$f":"IF(UPPER(E169)=\"REQUERIDO\", 10, \"\")","v":10},{"$f":"IF(UPPER(E169)=\"REQUERIDO\", H169, \"\")","v":0}]
["Máquina Cicladora",null,2,{"$f":"J164*C170","v":0},"Requerido",0,0,0,null,null,"EM",null,null,null,null,null,null,null,null,null,null,null,null,null,null,null,null,null,null,null,null,null,null,null,null,null,null,null,{"$f":"IF(UPPER(E170)=\"REQUERIDO\", 10, \"\")","v":10},{"$f":"IF(UPPER(E170)=\"REQUERIDO\", H170, \"\")","v":0}]
["Set de desechos","DIA_EQ_06",1,{"$f":"J164*C171","v":0},"Requerido",0,0,0,null,null,"MG",null,null,null,{"$f":"IF(UPPER(E171)=\"REQUERIDO\", 10, \"\")","v":10},{"$f":"IF(UPPER(E171)=\"REQUERIDO\", H171, \"\")","v":0}]
["Sistema Audiovisual de Información","DIA_EQ_03",1,{"$f":"J164*C172","v":0},"Requerido",0,0,0,null,null,"EG",null,null,null,null,null,null,null,null,null,null,null,null,null,null,null,null,null,null,null,{"$f":"IF(UPPER(E172)=\"REQUERIDO\", 10, \"\")","v":10},{"$f":"IF(UPPER(E172)=\"REQUERIDO\", H172, \"\")","v":0}]
["Área de recambios",{"$f":"B1","v":"Anx:"},{"$f":"C$1","v":"Cant x Espacio:"},"Requerido:","Tipo:","Funcional:","No Funcional:","Calif:","Observaciones:",{"$f":"Infraestructura!$F$54","v":0}]
["Sillón Reclinable",null,1,{"$f":"J173*C174","v":0},"Requerido",0,0,{"$f":"IF(AND(F174>=D174,F174>0,D174>0),10,0)","v":0},null,null,"MG",null,null,null,{"$f":"IF(UPPER(E174)=\"REQUERIDO\", 10, \"\")","v":10},{"$f":"IF(UPPER(E174)=\"REQUERIDO\", H174, \"\")","v":0}]
["Porta sueros",null,1,{"$f":"J173*C175","v":0},"Requerido",0,0,{"$f":"IF(AND(F175>=D175,F175>0,D175>0),10,0)","v":0},null,null,"MM",null,null,null,null,null,null,null,null,null,null,null,{"$f":"IF(UPPER(E175)=\"REQUERIDO\", 10, \"\")","v":10},{"$f":"IF(UPPER(E175)=\"REQUERIDO\", H175, \"\")","v":0}]
["Silla",null,1,{"$f":"J173*C176","v":0},"Requerido",0,0,{"$f":"IF(AND(F176>=D176,F176>0,D176>0),10,0)","v":0},null,null,"MG",null,null,null,{"$f":"IF(UPPER(E176)=\"REQUERIDO\", 10, \"\")","v":10},{"$f":"IF(UPPER(E176)=\"REQUERIDO\", H176, \"\")","v":0}]
["Set de desechos","DIA_EQ_06",1,{"$f":"J173*C177","v":0},"Requerido",0,0,{"$f":"IF(AND(F177>=D177,F177>0,D177>0),10,0)","v":0},null,null,"MG",null,null,null,10,0]
["Mesa",null,1,{"$f":"J173*C178","v":0},"Requerido",0,0,{"$f":"IF(AND(F178>=D178,F178>0,D178>0),10,0)","v":0},null,null,"MG",null,null,null,10,0]
["ÁREA TÉCNICA",null,null,null,null,null,null,null,null,null,null,null,null,null,null,null,null,null,null,null,null,null,null,null,null,null,null,null,null,null,null,null,null,null,null,null,null,null,null,null,null,null,null,null,null,null,{"$f":"SUM(O180:O191)","v":0},{"$f":"SUM(P180:P191)","v":0},{"$f":"SUM(Q180:Q191)","v":0},0,0,0,0,0,0,0,10,0,0,0,0,0,0,0,0,0,0,0,0,0,0,0,0,0,0,0,0,0]
["AMBIENTES",null,null,null,null,null,null,null,null,null,null,null,null,null,null,null,null,null,null,null,null,null,null,null,null,null,null,null,null,null,null,null,null,null,null,null,null,null,null,null,null,null,null,null,null,null,{"$f":"SUM(O181:O191)","v":0},{"$f":"SUM(P181:P191)","v":0},{"$f":"SUM(Q181:Q191)","v":0},0,0,0,0,0,0,0,10,0,0,0,0,0,0,0,0,0,0,0,0,0,0,0,0,0,0,0,0,0]
["Limpio",{"$f":"B1","v":"Anx:"},{"$f":"C$1","v":"Cant x Espacio:"},"Requerido:","Tipo:","Funcional:","No Funcional:","Calif:","Observaciones:",{"$f":"Infraestructura!$F$60","v":0}]
["Mueble bajo con mesón, lavabo y puertas bajas",null,1,{"$f":"J181*C182","v":0},{"$f":"IF(D182>0, \"Requerido\", \"Sin Infraestructura\")","v":"Sin Infraestructura"},0,0,{"$f":"IF(AND(F182>=D182,F182>0,D182>0),10,0)","v":0},null,null,"MG",null,null,null,{"$f":"IF(UPPER(E182)=\"REQUERIDO\", 10, \"\")","v":""},{"$f":"IF(UPPER(E182)=\"REQUERIDO\", H182, \"\")","v":""}]
["Armario vitrina",null,1,{"$f":"J181*C183","v":0},"Sin Infraestructura",0,0,0,null,null,"MG",null,null,null,"",""]
["Basurero con tapa y/o pedal",null,1,{"$f":"J181*C184","v":0},"Sin Infraestructura",0,0,0,null,null,"MG",null,null,null,"",""]
["Coche de curaciones ","DIA_EQ_04",1,{"$f":"J181*C185","v":0},"Opcional",0,0,0,null,null,"MM",null,null,null,null,null,null,null,null,null,null,null,null,null,{"$f":"IF(UPPER(E185)=\"OPCIONAL\", 10, 0)","v":10},{"$f":"IF(UPPER(E185)=\"OPCIONAL\", H185, \"\")","v":0}]
["Dispensador de papel toalla",null,1,{"$f":"J181*C186","v":0},"Sin Infraestructura",0,0,0,null,null,"MG",null,null,null,{"$f":"IF(UPPER(E186)=\"REQUERIDO\", 10, \"\")","v":""},{"$f":"IF(UPPER(E186)=\"REQUERIDO\", H186, \"\")","v":""}]
["Dosificador de jabón",null,1,{"$f":"J181*C187","v":0},"Sin Infraestructura",0,0,0,null,null,"MG",null,null,null,"",""]
["Usado",{"$f":"B1","v":"Anx:"},{"$f":"C$1","v":"Cant x Espacio:"},"Requerido:","Tipo:","Funcional:","No Funcional:","Calif:","Observaciones:",{"$f":"Infraestructura!$F$61","v":0}]
["Estantería básica",null,1,{"$f":"J188*C189","v":0},"Sin Infraestructura",0,0,{"$f":"IF(AND(F189>=D189,F189>0,D189>0),10,0)","v":0},null,null,"MG",null,null,null,{"$f":"IF(UPPER(E189)=\"REQUERIDO\", 10, \"\")","v":""},{"$f":"IF(UPPER(E189)=\"REQUERIDO\", H189, \"\")","v":""}]
["Basurero con tapa y/o pedal",null,2,{"$f":"J188*C190","v":0},"Sin Infraestructura",0,0,{"$f":"IF(AND(F190>=D190,F190>0,D190>0),10,0)","v":0},null,null,"MG",null,null,null,"",""]
["Mesón con fregadero de acero inoxidable",null,1,{"$f":"J188*C191","v":0},"Sin Infraestructura",0,0,{"$f":"IF(AND(F191>=D191,F191>0,D191>0),10,0)","v":0},null,null,"MG",null,null,null,"",""]
["SERVICIO DE DIAGNÓSTICO",null,null,null,null,null,null,null,null,null,null,null,null,null,null,null,null,null,null,null,null,null,{"$f":"IF(UPPER(E192)=\"REQUERIDO\", 10, \"\")","v":""},{"$f":"IF(UPPER(E192)=\"REQUERIDO\", H192, \"\")","v":""},null,null,null,null,null,null,null,null,null,null,null,null,null,null,null,null,null,null,null,null,null,null,{"$f":"SUM(O193:O231)","v":0},{"$f":"SUM(P193:P231)","v":0},{"$f":"SUM(Q193:Q231)","v":0},{"$f":"SUM(R193:R231)","v":0},0,0,0,0,0,0,0,0,0,0,0,0,0,0,10,0,0,0,0,0,0,0,0,0,0,0,10,0]
["LABORATORIO - PUESTO DE TOMA DE MUESTRAS",null,null,null,null,null,null,null,null,null,null,null,null,null,null,null,null,null,null,null,null,null,null,null,null,null,null,null,null,null,{"$f":"IF(UPPER(E193)=\"REQUERIDO\", 10, \"\")","v":""},{"$f":"IF(UPPER(E193)=\"REQUERIDO\", H193, \"\")","v":""},null,null,null,null,null,null,null,null,null,null,null,null,null,null,{"$f":"SUM(O193:O231)","v":0},{"$f":"SUM(P194:P231)","v":0},{"$f":"SUM(Q193:Q231)","v":0},{"$f":"SUM(R194:R231)","v":0},{"$f":"SUM(S193:S231)","v":0},{"$f":"SUM(T194:T231)","v":0},{"$f":"SUM(U193:U231)","v":0},{"$f":"SUM(V194:V231)","v":0},{"$f":"SUM(W193:W231)","v":0},{"$f":"SUM(X194:X231)","v":0},{"$f":"SUM(Y193:Y231)","v":0},{"$f":"SUM(Z194:Z231)","v":0},{"$f":"SUM(AA193:AA231)","v":0},{"$f":"SUM(AB194:AB231)","v":0},{"$f":"SUM(AC193:AC231)","v":0},{"$f":"SUM(AD194:AD231)","v":0},{"$f":"SUM(AE193:AE231)","v":0},{"$f":"SUM(AF194:AF231)","v":0},{"$f":"SUM(AG193:AG231)","v":10},{"$f":"SUM(AH194:AH231)","v":0},{"$f":"SUM(AI193:AI231)","v":0},{"$f":"SUM(AJ194:AJ231)","v":0},{"$f":"SUM(AK193:AK231)","v":0},{"$f":"SUM(AL194:AL231)","v":0},{"$f":"SUM(AM193:AM231)","v":0},{"$f":"SUM(AN194:AN231)","v":0},{"$f":"SUM(AO193:AO231)","v":0},{"$f":"SUM(AP194:AP231)","v":0},{"$f":"SUM(AQ193:AQ231)","v":0},{"$f":"SUM(AR194:AR231)","v":0},{"$f":"SUM(AS193:AS231)","v":10},{"$f":"SUM(AT194:AT231)","v":0}]
["ÁREA DE TOMA DE MUESTRAS",null,null,null,null,null,null,null,null,null,null,null,null,null,null,null,null,null,null,null,null,null,null,null,null,null,null,null,null,null,{"$f":"IF(UPPER(E194)=\"REQUERIDO\", 10, \"\")","v":""},{"$f":"IF(UPPER(E194)=\"REQUERIDO\", H194, \"\")","v":""},null,null,null,null,null,null,null,null,null,null,null,null,null,null,{"$f":"SUM(O195:O224)","v":0},{"$f":"SUM(P195:P224)","v":0},{"$f":"SUM(Q195:Q224)","v":0},0,0,0,0,0,0,0,0,0,0,0,0,0,0,0,10,0,0,0,0,0,0,0,0,0,0,0,0,0]
["AMBIENTES",null,null,null,null,null,null,null,null,null,null,null,null,null,null,null,null,null,null,null,null,null,null,null,null,null,null,null,null,null,null,null,null,null,null,null,null,null,null,null,null,null,null,null,null,null,{"$f":"SUM(O196:O224)","v":0},{"$f":"SUM(P196:P224)","v":0},{"$f":"SUM(Q196:Q224)","v":0},0,0,0,0,0,0,0,0,0,0,0,0,0,0,0,10,0,0,0,0,0,0,0,0,0,0,0,0,0]
["Baterías sanitarias",{"$f":"B1","v":"Anx:"},{"$f":"C$1","v":"Cant x Espacio:"},"Requerido:","Tipo:","Funcional:","No Funcional:","Calif:","Observaciones:",{"$f":"Infraestructura!F70","v":0}]
["Dosificador de jabón",null,1,{"$f":"J196*C197","v":0},{"$f":"IF(D197>0, \"Requerido\", \"Sin Infraestructura\")","v":"Sin Infraestructura"},0,0,{"$f":"IF(AND(F197>=D197,F197>0,D197>0),10,0)","v":0},null,null,"MG",null,null,null,{"$f":"IF(UPPER(E197)=\"REQUERIDO\", 10, \"\")","v":""},{"$f":"IF(UPPER(E197)=\"REQUERIDO\", H197, \"\")","v":""}]
["Dispensador de papel toalla",null,1,{"$f":"J196*C198","v":0},"Sin Infraestructura",0,0,{"$f":"IF(AND(F198>=D198,F198>0,D198>0),10,0)","v":0},null,null,"MG",null,null,null,"",""]
["Dispensador de papel higiénico",null,1,{"$f":"J196*C199","v":0},"Sin Infraestructura",0,0,0,null,null,null,null,null,null,null,null,null,null,null,null,null,null,null,null,null,null,null,null,null,null,{"$f":"IF(UPPER(E199)=\"REQUERIDO\", 10, \"\")","v":""},{"$f":"IF(UPPER(E199)=\"REQUERIDO\", H199, \"\")","v":""}]
["Espejo empotrado ",null,1,{"$f":"J196*C200","v":0},"Sin Infraestructura",0,0,0,null,null,"MG",null,null,null,{"$f":"IF(UPPER(E200)=\"REQUERIDO\", 10, \"\")","v":""},{"$f":"IF(UPPER(E200)=\"REQUERIDO\", H200, \"\")","v":""}]
["Gancho doble",null,1,{"$f":"J196*C201","v":0},"Sin Infraestructura",0,0,0,null,null,"MG",null,null,null,"",""]
["Juego de ayudas técnicas",null,1,{"$f":"J196*C202","v":0},"Sin Infraestructura",0,0,0,null,null,"MG",null,null,null,"",""]
["Lavabo ",null,1,{"$f":"J196*C203","v":0},"Sin Infraestructura",0,0,0,null,null,"MG",null,null,null,"",""]
["Basurero con tapa y/o pedal",null,1,{"$f":"J196*C204","v":0},"Sin Infraestructura",0,0,0,null,null,"MG",null,null,null,"",""]
["Sala de espera",{"$f":"B1","v":"Anx:"},{"$f":"C$1","v":"Cant x Espacio:"},"Requerido:","Tipo:","Funcional:","No Funcional:","Calif:","Observaciones:",{"$f":"Infraestructura!F71","v":0}]
["Bancas / individuales/3 puestos/ 4 puestos",null,3,{"$f":"J205*C206","v":0},{"$f":"IF(D206>0, \"Requerido\", \"Sin Infraestructura\")","v":"Sin Infraestructura"},0,0,{"$f":"IF(AND(F206>=D206,F206>0,D206>0),10,0)","v":0},null,null,"MG",null,null,null,{"$f":"IF(UPPER(E206)=\"REQUERIDO\", 10, \"\")","v":""},{"$f":"IF(UPPER(E206)=\"REQUERIDO\", H206, \"\")","v":""}]
["Basurero con tapa y/o pedal",null,1,{"$f":"J205*C207","v":0},{"$f":"IF(D207>0, \"Requerido\", \"Sin Infraestructura\")","v":"Sin Infraestructura"},0,0,0,null,null,"MG",null,null,null,"",""]
["Reloj de pared",null,1,{"$f":"J205*C208","v":0},{"$f":"IF(D208>0, \"Requerido\", \"Sin Infraestructura\")","v":"Sin Infraestructura"},0,0,0,null,null,"MG",null,null,null,"",""]
["Tablero de avisos ",null,1,{"$f":"J205*C209","v":0},{"$f":"IF(D209>0, \"Requerido\", \"Sin Infraestructura\")","v":"Sin Infraestructura"},0,0,0,null,null,"MG",null,null,null,"",""]
["Sistema Audiovisual de Información",null,1,{"$f":"J205*C210","v":0},{"$f":"IF(D210>0, \"Requerido\", \"Sin Infraestructura\")","v":"Sin Infraestructura"},0,0,0,null,null,"EG",null,null,null,null,null,null,null,null,null,null,null,null,null,null,null,null,null,null,null,{"$f":"IF(UPPER(E210)=\"REQUERIDO\", 10, \"\")","v":""},{"$f":"IF(UPPER(E210)=\"REQUERIDO\", H210, \"\")","v":""}]
["Toma de muestras",{"$f":"B1","v":"Anx:"},{"$f":"C$1","v":"Cant x Espacio:"},"Requerido:","Tipo:","Funcional:","No Funcional:","Calif:","Observaciones:",{"$f":"Infraestructura!F72","v":0}]
["Sillón toma de muestras",null,1,{"$f":"J211*C212","v":0},{"$f":"IF(D212>0, \"Requerido\", \"Sin Infraestructura\")","v":"Sin Infraestructura"},0,0,{"$f":"IF(AND(F212>=D212,F212>0,D212>0),10,0)","v":0},null,null,"MG",null,null,null,{"$f":"IF(UPPER(E212)=\"REQUERIDO\", 10, \"\")","v":""},{"$f":"IF(UPPER(E212)=\"REQUERIDO\", H212, \"\")","v":""}]
["Coche de curaciones ",null,1,{"$f":"J211*C213","v":0},"Sin Infraestructura",0,0,0,null,null,"MM",null,null,null,null,null,null,null,null,null,null,null,{"$f":"IF(UPPER(E213)=\"REQUERIDO\", 10, \"\")","v":""},{"$f":"IF(UPPER(E213)=\"REQUERIDO\", H213, \"\")","v":""}]
["Set de desechos",null,1,{"$f":"J211*C214","v":0},"Sin Infraestructura",0,0,0,null,null,"MG",null,null,null,{"$f":"IF(UPPER(E214)=\"REQUERIDO\", 10, \"\")","v":""},{"$f":"IF(UPPER(E214)=\"REQUERIDO\", H214, \"\")","v":""}]
["Dispensador de papel toalla",null,1,{"$f":"J211*C215","v":0},"Sin Infraestructura",0,0,0,null,null,"MG",null,null,null,"",""]
["Dosificador de jabón",null,1,{"$f":"J211*C216","v":0},"Sin Infraestructura",0,0,0,null,null,"MG",null,null,null,"",""]
["Lavabo ",null,1,{"$f":"J211*C217","v":0},"Sin Infraestructura",0,0,0,null,null,"MG",null,null,null,"",""]
["Mueble bajo con mesón, lavabo y puertas bajas",null,1,{"$f":"J211*C218","v":0},"Sin Infraestructura",0,0,0,null,null,"MG",null,null,null,"",""]
["Refrigerador",null,1,{"$f":"J211*C219","v":0},"Opcional",0,0,0,null,null,"EG",null,null,null,null,null,null,null,null,null,null,null,null,null,null,null,null,null,null,null,null,null,{"$f":"IF(UPPER(E219)=\"OPCIONAL\", 10, \"\")","v":10},{"$f":"IF(UPPER(E219)=\"OPCIONAL\", H219, \"\")","v":0}]
["Taburete bajo con respaldo, con ruedas",null,1,{"$f":"J211*C220","v":0},{"$f":"IF(D220>0, \"Requerido\", \"Sin Infraestructura\")","v":"Sin Infraestructura"},0,0,0,null,null,"MG",null,null,null,{"$f":"IF(UPPER(E220)=\"REQUERIDO\", 10, \"\")","v":""},{"$f":"IF(UPPER(E220)=\"REQUERIDO\", H220, \"\")","v":""}]
["Usado",{"$f":"B1","v":"Anx:"},{"$f":"C$1","v":"Cant x Espacio:"},"Requerido:","Tipo:","Funcional:","No Funcional:","Calif:","Observaciones:",{"$f":"Infraestructura!F73","v":0}]
["Estantería básica",null,1,{"$f":"J221*C222","v":0},{"$f":"IF(D222>0, \"Requerido\", \"Sin Infraestructura\")","v":"Sin Infraestructura"},0,0,{"$f":"IF(AND(F222>=D222,F222>0,D222>0),10,0)","v":0},null,null,"MG",null,null,null,{"$f":"IF(UPPER(E222)=\"REQUERIDO\", 10, \"\")","v":""},{"$f":"IF(UPPER(E222)=\"REQUERIDO\", H222, \"\")","v":""}]
["Set de desechos",null,1,{"$f":"J221*C223","v":0},{"$f":"IF(D223>0, \"Requerido\", \"Sin Infraestructura\")","v":"Sin Infraestructura"},0,0,0,null,null,"MG",null,null,null,"",""]
["Mueble en acero inoxidable C/encimera y vertedero.",null,1,{"$f":"J221*C224","v":0},{"$f":"IF(D224>0, \"Requerido\", \"Sin Infraestructura\")","v":"Sin Infraestructura"},0,0,{"$f":"IF(AND(F224>=D224,F224>0,D224>0),10,0)","v":0},null,null,"MG",null,null,null,"",""]
["ÁREA DE PROCESAMIENTO",null,null,null,null,null,null,null,null,null,null,null,null,null,null,null,null,null,null,null,null,null,null,null,null,null,null,null,null,null,{"$f":"IF(UPPER(E225)=\"REQUERIDO\", 10, \"\")","v":""},{"$f":"IF(UPPER(E225)=\"REQUERIDO\", H225, \"\")","v":""},null,null,null,null,null,null,null,null,null,null,null,null,null,null,{"$f":"SUM(O226:O231)","v":0},{"$f":"SUM(P226:P231)","v":0},{"$f":"SUM(Q226:Q231)","v":0},0,0,0,0,0,0,0,0,0,0,0,0,0,0,0,0,0,0,0,0,0,0,0,0,0,0,0,10,0]
["AMBIENTES",null,null,null,null,null,null,null,null,null,null,null,null,null,null,null,null,null,null,null,null,null,null,null,null,null,null,null,null,null,null,null,null,null,null,null,null,null,null,null,null,null,null,null,null,null,{"$f":"SUM(O227:O231)","v":0},{"$f":"SUM(P227:P231)","v":0},{"$f":"SUM(Q227:Q231)","v":0},0,0,0,0,0,0,0,0,0,0,0,0,0,0,0,0,0,0,0,0,0,0,0,0,0,0,0,10,0]
["Área de determinaciones rápidas/pre análisis",{"$f":"B1","v":"Anx:"},{"$f":"C$1","v":"Cant x Espacio:"},"Requerido:","Tipo:","Funcional:","No Funcional:","Calif:","Observaciones:",{"$f":"Infraestructura!F79","v":0}]
["Centrífuga",null,1,{"$f":"J227*C228","v":0},{"$f":"IF(D228>0, \"Requerido\", \"Sin Infraestructura\")","v":"Sin Infraestructura"},0,0,{"$f":"IF(AND(F228>=D228,F228>0,D228>0),10,0)","v":0},null,null,"EM",null,null,null,null,null,null,null,null,null,null,null,null,null,null,null,null,null,null,null,null,null,null,null,null,null,null,null,{"$f":"IF(UPPER(E228)=\"REQUERIDO\", 10, \"\")","v":""},{"$f":"IF(UPPER(E228)=\"REQUERIDO\", H228, \"\")","v":""}]
["Analizador de gases, iones en sangre con cooximetría",null,1,{"$f":"J227*C229","v":0},"Condición",0,0,{"$f":"IF(AND(F229>=D229,F229>0,D229>0),10,0)","v":0},null,null,"EM",null,null,null,null,null,null,null,null,null,null,null,null,null,null,null,null,null,null,null,null,null,null,null,null,null,null,null,null,null,null,null,null,null,{"$f":"IF(UPPER(E229)=\"CONDICIÓN\", 10, 0)","v":10},{"$f":"IF(UPPER(E229)=\"CONDICIÓN\", H229, \"\")","v":0}]
["Mesón con Lavabo y puertas bajas",null,1,{"$f":"J227*C230","v":0},{"$f":"IF(D230>0, \"Requerido\", \"Sin Infraestructura\")","v":"Sin Infraestructura"},0,0,{"$f":"IF(AND(F230>=D230,F230>0,D230>0),10,0)","v":0},null,null,"MM",null,null,null,null,null,null,null,null,null,null,null,{"$f":"IF(UPPER(E230)=\"REQUERIDO\", 10, \"\")","v":""},{"$f":"IF(UPPER(E230)=\"REQUERIDO\", H230, \"\")","v":""}]
["Taburete alto con respaldo, con ruedas y apoyapies",null,1,{"$f":"J227*C231","v":0},{"$f":"IF(D231>0, \"Requerido\", \"Sin Infraestructura\")","v":"Sin Infraestructura"},0,0,{"$f":"IF(AND(F231>=D231,F231>0,D231>0),10,0)","v":0},null,null,"MG",null,null,null,{"$f":"IF(UPPER(E231)=\"REQUERIDO\", 10, \"\")","v":""},{"$f":"IF(UPPER(E231)=\"REQUERIDO\", H231, \"\")","v":""}]
["SERVICIOS DE APOYO",null,null,null,null,null,null,null,null,null,null,null,null,null,null,null,null,null,null,null,null,null,null,null,null,null,null,null,null,null,null,null,null,null,null,null,null,null,null,null,null,null,null,null,null,null,{"$f":"SUM(O233:O327)","v":190},{"$f":"SUM(P233:P327)","v":0},{"$f":"SUM(Q233:Q327)","v":0},0,{"$f":"SUM(S233:S327)","v":40},0,0,0,0,0,0,0,0,0,0,0,30,0,30,0,{"$f":"SUM(AI233:AI327)","v":0},0,0,0,20,0,0,0,0,0,0,0]
["FARMACIA",null,null,null,null,null,null,null,null,null,null,null,null,null,null,null,null,null,null,null,null,null,null,null,null,null,null,null,null,null,null,null,null,null,null,null,null,null,null,null,null,null,null,null,null,null,{"$f":"SUM(O234:O299)","v":140},{"$f":"SUM(P234:P299)","v":0},{"$f":"SUM(Q234:Q299)","v":0},0,30,0,0,0,0,0,0,0,0,0,0,0,20,0,{"$f":"SUM(AG234:AG299)","v":30},{"$f":"SUM(AH234:AH299)","v":0},0,0,0,0,20,0,0,0,0,0,0,0]
["ÁREA ADMINISTRATIVA Y DE PERSONAL",null,null,null,null,null,null,null,null,null,null,null,null,null,null,null,null,null,null,null,null,null,null,null,null,null,null,null,null,null,null,null,null,null,null,null,null,null,null,null,null,null,null,null,null,null,{"$f":"SUM(O235:O269)","v":60},{"$f":"SUM(P235:P269)","v":0},{"$f":"SUM(Q235:Q269)","v":0},0,30,0,0,0,0,0,0,0,0,0,0,0,0,0,0,0,0,0,0,0,20,0,0,0,0,0,0,0]
["AMBIENTES",null,null,null,null,null,null,null,null,null,null,null,null,null,null,null,null,null,null,null,null,null,null,null,null,null,null,null,null,null,null,null,null,null,null,null,null,null,null,null,null,null,null,null,null,null,{"$f":"SUM(O236:O269)","v":60},{"$f":"SUM(P236:P269)","v":0},{"$f":"SUM(Q236:Q269)","v":0},0,30,0,0,0,0,0,0,0,0,0,0,0,0,0,0,0,0,0,0,0,20,0,0,0,0,0,0,0]
["Baño de personal",{"$f":"B1","v":"Anx:"},{"$f":"C$1","v":"Cant x Espacio:"},"Requerido:","Tipo:","Funcional:","No Funcional:","Calif:","Observaciones:",{"$f":"Infraestructura!F87","v":0}]
["Dosificador de jabón",null,1,{"$f":"J236*C237","v":0},{"$f":"IF(D237>0, \"Requerido\", \"Sin Infraestructura\")","v":"Sin Infraestructura"},0,0,{"$f":"IF(AND(F237>=D237,F237>0,D237>0),10,0)","v":0},null,null,"MG",null,null,null,{"$f":"IF(UPPER(E237)=\"REQUERIDO\", 10, \"\")","v":""},{"$f":"IF(UPPER(E237)=\"REQUERIDO\", H237, \"\")","v":""},null,null,null,null,null,null,null,null,null,null,null,null,null,null,null,null,null,null,null,null,null,null,null,null,null,null,null,null,null,null,null," "]
["Dispensador de papel higiénico",null,1,{"$f":"J236*C238","v":0},"Sin Infraestructura",0,0,0,null,null,"MG",null,null,null,"",""]
["Dispensador de papel toalla",null,1,{"$f":"J236*C239","v":0},"Sin Infraestructura",0,0,0,null,null,"MG",null,null,null,"",""]
["Espejo empotrado ",null,1,{"$f":"J236*C240","v":0},"Sin Infraestructura",0,0,0,null,null,"MG",null,null,null,"",""]
["Juego de ayudas técnicas",null,1,{"$f":"J236*C241","v":0},"Deseable",0,0,0,null,null,"MG",null,null,null,null,null,null,null,{"$f":"IF(UPPER(E241)=\"DESEABLE\", 10, 0)","v":10},{"$f":"IF(UPPER(E241)=\"DESEABLE\", H241, \"\")","v":0}]
["Lavabo",null,1,{"$f":"J236*C242","v":0},"Sin Infraestructura",0,0,0,null,null,"MG",null,null,null,"",""]
["Gancho doble",null,1,{"$f":"J236*C243","v":0},"Sin Infraestructura",0,0,0,null,null,"MG",null,null,null,"",""]
["Badurero con tapa y/o pedal",null,1,{"$f":"J236*C244","v":0},"Sin Infraestructura",0,0,0,null,null,"MG",null,null,null,"",""]
["Juego de ayudas técnicas",null,1,{"$f":"J236*C245","v":0},"Deseable",0,0,0,null,null,"MG",null,null,null,null,null,null,null,{"$f":"IF(UPPER(E245)=\"DESEABLE\", 10, 0)","v":10},{"$f":"IF(UPPER(E245)=\"DESEABLE\", H245, \"\")","v":0}]
["Despacho Químico",{"$f":"B1","v":"Anx:"},{"$f":"C$1","v":"Cant x Espacio:"},"Requerido:","Tipo:","Funcional:","No Funcional:","Calif:","Observaciones:",{"$f":"Infraestructura!$F$88","v":0}]
["Mesa de despacho con ala para ordenador","DIA_EQ_01",1,{"$f":"J246*C247","v":0},"Requerido",0,0,{"$f":"IF(AND(F247>=D247,F247>0,D247>0),10,0)","v":0},null,null,"MG",null,null,null,{"$f":"IF(UPPER(E247)=\"REQUERIDO\", 10, \"\")","v":10},{"$f":"IF(UPPER(E247)=\"REQUERIDO\", H247, \"\")","v":0}]
["Armario con cajones y estantes/Archivador",null,1,{"$f":"J246*C248","v":0},"Requerido",0,0,{"$f":"IF(AND(F248>=D248,F248>0,D248>0),10,0)","v":0},null,null,"MG",null,null,null,10,0]
["Scanner",null,1,{"$f":"J246*C249","v":0},"Requerido",0,0,{"$f":"IF(AND(F249>=D249,F249>0,D249>0),10,0)","v":0},null,null,"EM",null,null,null,null,null,null,null,null,null,null,null,null,null,null,null,null,null,null,null,null,null,null,null,null,null,null,null,{"$f":"IF(UPPER(E249)=\"REQUERIDO\", 10, \"\")","v":10},{"$f":"IF(UPPER(E249)=\"REQUERIDO\", H249, \"\")","v":0}]
["Computador completo PC /Computador Portátil","DIA_EQ_02",1,{"$f":"J246*C250","v":0},"Requerido",0,0,{"$f":"IF(AND(F250>=D250,F250>0,D250>0),10,0)","v":0},null,null,"EM",null,null,null,null,null,null,null,null,null,null,null,null,null,null,null,null,null,null,null,null,null,null,null,null,null,null,null,10,0]
["Basurero con tapa y/o pedal",null,1,{"$f":"J246*C251","v":0},"Requerido",0,0,0,null,null,"MG",null,null,null,{"$f":"IF(UPPER(E251)=\"REQUERIDO\", 10, \"\")","v":10},{"$f":"IF(UPPER(E251)=\"REQUERIDO\", H251, \"\")","v":0}]
["Perchero de pie",null,1,{"$f":"J246*C252","v":0},"Requerido",0,0,0,null,null,"MG",null,null,null,10,0]
["Silla confidente",null,4,{"$f":"J246*C253","v":0},"Requerido",0,0,0,null,null,"MG",null,null,null,10,0]
["Silla",null,1,{"$f":"J246*C254","v":0},"Requerido",0,0,0,null,null,"MG",null,null,null,10,0]
["Secretaría",{"$f":"B1","v":"Anx:"},{"$f":"C$1","v":"Cant x Espacio:"},"Requerido:","Tipo:","Funcional:","No Funcional:","Calif:","Observaciones:",{"$f":"Infraestructura!$F$89","v":0}]
["Mesa de despacho con ala para ordenador","DIA_EQ_01",1,{"$f":"J255*C256","v":0},{"$f":"IF(D256>0, \"Requerido\", \"Sin Infraestructura\")","v":"Sin Infraestructura"},0,0,{"$f":"IF(AND(F256>=D256,F256>0,D256>0),10,0)","v":0},null,null,"MG",null,null,null,{"$f":"IF(UPPER(E256)=\"REQUERIDO\", 10, \"\")","v":""},{"$f":"IF(UPPER(E256)=\"REQUERIDO\", H256, \"\")","v":""}]
["Armario con cajones y estantes/Archivador",null,1,{"$f":"J255*C257","v":0},{"$f":"IF(D257>0, \"Requerido\", \"Sin Infraestructura\")","v":"Sin Infraestructura"},0,0,0,null,null,"MG",null,null,null,"",""]
["Computador completo PC /Computador Portátil","DIA_EQ_02",1,{"$f":"J255*C258","v":0},{"$f":"IF(D258>0, \"Requerido\", \"Sin Infraestructura\")","v":"Sin Infraestructura"},0,0,0,null,null,"EM",null,null,null,null,null,null,null,null,null,null,null,null,null,null,null,null,null,null,null,null,null,null,null,null,null,null,null,{"$f":"IF(UPPER(E258)=\"REQUERIDO\", 10, \"\")","v":""},{"$f":"IF(UPPER(E258)=\"REQUERIDO\", H258, \"\")","v":""}]
["Basurero con tapa y/o pedal",null,1,{"$f":"J255*C259","v":0},{"$f":"IF(D259>0, \"Requerido\", \"Sin Infraestructura\")","v":"Sin Infraestructura"},0,0,0,null,null,"MG",null,null,null,{"$f":"IF(UPPER(E259)=\"REQUERIDO\", 10, \"\")","v":""},{"$f":"IF(UPPER(E259)=\"REQUERIDO\", H259, \"\")","v":""}]
["Perchero de pie",null,1,{"$f":"J255*C260","v":0},{"$f":"IF(D260>0, \"Requerido\", \"Sin Infraestructura\")","v":"Sin Infraestructura"},0,0,{"$f":"IF(AND(F260>=D260,F260>0,D260>0),10,0)","v":0},null,null,"MG",null,null,null,"",""]
["Silla confidente",null,1,{"$f":"J255*C261","v":0},{"$f":"IF(D261>0, \"Requerido\", \"Sin Infraestructura\")","v":"Sin Infraestructura"},0,0,0,null,null,"MG",null,null,null,"",""]
["Silla",null,1,{"$f":"J255*C262","v":0},{"$f":"IF(D262>0, \"Requerido\", \"Sin Infraestructura\")","v":"Sin Infraestructura"},0,0,0,null,null,"MG",null,null,null,"",""]
["Trabajo Admninistrativo",{"$f":"B9","v":0},{"$f":"C$1","v":"Cant x Espacio:"},"Requerido:","Tipo:","Funcional:","No Funcional:","Calif:","Observaciones:",{"$f":"Infraestructura!$F$90","v":0}]
["Mesa de trabajo  ","DIA_EQ_01",1,{"$f":"J263*C264","v":0},{"$f":"IF(D264>0, \"Requerido\", \"Sin Infraestructura\")","v":"Sin Infraestructura"},0,0,{"$f":"IF(AND(F264>=D264,F264>0,D264>0),10,0)","v":0},null,null,"MG",null,null,null,{"$f":"IF(UPPER(E264)=\"REQUERIDO\", 10, \"\")","v":""},{"$f":"IF(UPPER(E264)=\"REQUERIDO\", H264, \"\")","v":""}]
["Armario con cajones y estantes/Archivador",null,1,{"$f":"J263*C265","v":0},{"$f":"IF(D265>0, \"Requerido\", \"Sin Infraestructura\")","v":"Sin Infraestructura"},0,0,0,null,null,"MG",null,null,null,"",""]
["Computador completo PC /Computador Portátil","DIA_EQ_02",1,{"$f":"J263*C266","v":0},{"$f":"IF(D266>0, \"Requerido\", \"Sin Infraestructura\")","v":"Sin Infraestructura"},0,0,{"$f":"IF(AND(F266>=D266,F266>0,D266>0),10,0)","v":0},null,null,"EG",null,null,null,null,null,null,null,null,null,null,null,null,null,null,null,null,null,null,null,{"$f":"IF(UPPER(E266)=\"REQUERIDO\", 10, \"\")","v":""},{"$f":"IF(UPPER(E266)=\"REQUERIDO\", H266, \"\")","v":""}]
["Basurero con tapa y/o pedal",null,1,{"$f":"J263*C267","v":0},{"$f":"IF(D267>0, \"Requerido\", \"Sin Infraestructura\")","v":"Sin Infraestructura"},0,0,0,null,null,"MG",null,null,null,{"$f":"IF(UPPER(E267)=\"REQUERIDO\", 10, \"\")","v":""},{"$f":"IF(UPPER(E267)=\"REQUERIDO\", H267, \"\")","v":""}]
["Perchero de pie",null,1,{"$f":"J263*C268","v":0},"Deseable",0,0,0,null,null,"MG",null,null,null,null,null,null,null,{"$f":"IF(UPPER(E268)=\"DESEABLE\", 10, 0)","v":10},{"$f":"IF(UPPER(E268)=\"DESEABLE\", H268, \"\")","v":0}]
["Silla",null,1,{"$f":"J263*C269","v":0},{"$f":"IF(D269>0, \"Requerido\", \"Sin Infraestructura\")","v":"Sin Infraestructura"},0,0,0,null,null,"MG",null,null,null,"",""]
["ÁREA DE RECEPCIÓN, ALMACENAMIENTO Y SUMINISTRO (CON CONTROL DE ACCESO)",null,null,null,null,null,null,null,null,null,null,null,null,null,null,null,null,null,null,null,null,null,null,null,null,null,null,null,null,null,null,null,null,null,null,null,null,null,null,null,null,null,null,null,null,null,{"$f":"SUM(O271:O282)","v":20},{"$f":"SUM(P271:P282)","v":0},{"$f":"SUM(Q271:Q282)","v":0},0,0,0,0,0,0,0,0,0,0,0,0,0,0,0,0,0,0,0,0,0,0,0,0,0,0,0,0,0]
["AMBIENTES",null,null,null,null,null,null,null,null,null,null,null,null,null,null,null,null,null,null,null,null,null,null,null,null,null,null,null,null,null,null,null,null,null,null,null,null,null,null,null,null,null,null,null,null,null,{"$f":"SUM(O272:O282)","v":20},{"$f":"SUM(P272:P282)","v":0},{"$f":"SUM(Q272:Q282)","v":0},0,0,0,0,0,0,0,0,0,0,0,0,0,0,0,0,0,0,0,0,0,0,0,0,0,0,0,0,0]
["Bodega General",{"$f":"B1","v":"Anx:"},{"$f":"C$1","v":"Cant x Espacio:"},"Requerido:","Tipo:","Funcional:","No Funcional:","Calif:","Observaciones:",{"$f":"Infraestructura!$F$96","v":0}]
["Estantería básica",null,1,{"$f":"J272*C273","v":0},"Requerido",0,0,{"$f":"IF(AND(F273>=D273,F273>0,D273>0),10,0)","v":0},null,null,"MG",null,null,null,{"$f":"IF(UPPER(E273)=\"REQUERIDO\", 10, \"\")","v":10},{"$f":"IF(UPPER(E273)=\"REQUERIDO\", H273, \"\")","v":0}]
["Escalera pata de gallo",null,1,{"$f":"J272*C274","v":0},"Requerido",0,0,0,null,null,"MG",null,null,null,10,0]
["Recepción y Admisión",{"$f":"B1","v":"Anx:"},{"$f":"C$1","v":"Cant x Espacio:"},"Requerido:","Tipo:","Funcional:","No Funcional:","Calif:","Observaciones:",{"$f":"Infraestructura!$F$97","v":0}]
["Mostrador ","DIA_EQ_01",1,{"$f":"$J$275*C276","v":0},{"$f":"IF(D276>0, \"Requerido\", \"Sin Infraestructura\")","v":"Sin Infraestructura"},0,0,0,null,null,"MG",null,null,null,{"$f":"IF(UPPER(E276)=\"REQUERIDO\", 10, \"\")","v":""},{"$f":"IF(UPPER(E276)=\"REQUERIDO\", H276, \"\")","v":""}]
["Armario con cajones y estantes/Archivador",null,1,{"$f":"$J$275*C277","v":0},"Sin Infraestructura",0,0,{"$f":"IF(AND(F277>=D277,F277>0,D277>0),10,0)","v":0},null,null,"MG",null,null,null,"",""]
["Computador completo PC /Computador Portátil","DIA_EQ_02",1,{"$f":"$J$275*C278","v":0},"Sin Infraestructura",0,0,{"$f":"IF(AND(F278>=D278,F278>0,D278>0),10,0)","v":0},null,null,"EM",null,null,null,null,null,null,null,null,null,null,null,null,null,null,null,null,null,null,null,null,null,null,null,null,null,null,null,{"$f":"IF(UPPER(E278)=\"REQUERIDO\", 10, \"\")","v":""},{"$f":"IF(UPPER(E278)=\"REQUERIDO\", H278, \"\")","v":""}]
["Basurero con tapa y/o pedal",null,1,{"$f":"$J$275*C279","v":0},"Sin Infraestructura",0,0,{"$f":"IF(AND(F279>=D279,F279>0,D279>0),10,0)","v":0},null,null,"MG",null,null,null,{"$f":"IF(UPPER(E279)=\"REQUERIDO\", 10, \"\")","v":""},{"$f":"IF(UPPER(E279)=\"REQUERIDO\", H279, \"\")","v":""}]
["Silla",null,1,{"$f":"$J$275*C280","v":0},"Sin Infraestructura",0,0,0,null,null,"MG",null,null,null,"",""]
["Tablero de avisos ",null,1,{"$f":"$J$275*C281","v":0},"Sin Infraestructura",0,0,0,null,null,"MG",null,null,null,"",""]
["Teléfono",null,1,{"$f":"$J$275*C282","v":0},"Sin Infraestructura",0,0,0,null,null,"EM",null,null,null,null,null,null,null,null,null,null,null,null,null,null,null,null,null,null,null,null,null,null,null,null,null,null,null,{"$f":"IF(UPPER(E282)=\"REQUERIDO\", 10, \"\")","v":""},{"$f":"IF(UPPER(E282)=\"REQUERIDO\", H282, \"\")","v":""}]
["Acceso exterior",{"$f":"B1","v":"Anx:"},{"$f":"C$1","v":"Cant x Espacio:"},"Requerido:","Tipo:","Funcional:","No Funcional:","Calif:","Observaciones:",{"$f":"Infraestructura!$F$98","v":0}]
["ÁREA TECNICA",null,null,null,null,null,null,null,null,null,null,null,null,null,null,null,null,null,null,null,null,null,null,null,null,null,null,null,null,null,null,null,null,null,null,null,null,null,null,null,null,null,null,null,null,null,{"$f":"SUM(O285:O299)","v":60},{"$f":"SUM(P285:P299)","v":0},{"$f":"SUM(Q285:Q299)","v":0},0,0,{"$f":"SUM(T285:T299)","v":0},0,0,{"$f":"SUM(W285:W299)","v":0},0,0,{"$f":"SUM(Z285:Z299)","v":0},0,0,{"$f":"SUM(AC285:AC299)","v":0},0,20,{"$f":"SUM(AF285:AF299)","v":0},30,{"$f":"SUM(AH285:AH299)","v":0},{"$f":"SUM(AI285:AI299)","v":0},0,0,{"$f":"SUM(AL285:AL299)","v":0},0,0,{"$f":"SUM(AO285:AO299)","v":0},0,0,{"$f":"SUM(AR285:AR299)","v":0},0,0]
["AMBIENTES",null,null,null,null,null,null,null,null,null,null,null,null,null,null,null,null,null,null,null,null,null,null,null,null,null,null,null,null,null,null,null,null,null,null,null,null,null,null,null,null,null,null,null,null,null,{"$f":"SUM(O286:O299)","v":60},{"$f":"SUM(P286:P299)","v":0},{"$f":"SUM(Q286:Q299)","v":0},0,0,0,0,0,0,0,0,0,0,0,0,0,20,0,{"$f":"SUM(AG286:AG299)","v":30},{"$f":"SUM(AH286:AH299)","v":0},0,0,0,0,0,0,0,0,0,0,0,0]
["Zona de Dispensación Externa",{"$f":"B1","v":"Anx:"},{"$f":"C$1","v":"Cant x Espacio:"},"Requerido:","Tipo:","Funcional:","No Funcional:","Calif:","Observaciones:",{"$f":"Infraestructura!$F$104","v":0}]
["Mostrador de farmacia",null,1,{"$f":"$J$286*C287","v":0},"Requerido",0,0,{"$f":"IF(AND(F287>=D287,F287>0,D287>0),10,0)","v":0},null,null,"MG",null,null,null,{"$f":"IF(UPPER(E287)=\"REQUERIDO\", 10, \"\")","v":10},{"$f":"IF(UPPER(E287)=\"REQUERIDO\", H287, \"\")","v":0}]
["Armario con cajones y estantes/ Columnas de Almacenamiento/Estantería",null,1,{"$f":"$J$286*C288","v":0},"Requerido",0,0,0,null,null,"MG",null,null,null,{"$f":"IF(UPPER(E288)=\"REQUERIDO\", 10, \"\")","v":10},{"$f":"IF(UPPER(E288)=\"REQUERIDO\", H288, \"\")","v":0}]
["Impresora ",null,1,0,"Opcional",0,0,0,null,null,"EG",null,null,null,null,null,null,null,null,null,null,null,null,null,null,null,null,null,null,null,null,null,{"$f":"IF(UPPER(E289)=\"OPCIONAL\", 10, \"\")","v":10},{"$f":"IF(UPPER(E289)=\"OPCIONAL\", H289, \"\")","v":0}]
["Scanner",null,1,0,"Opcional",0,0,0,null,null,"EG",null,null,null,null,null,null,null,null,null,null,null,null,null,null,null,null,null,null,null,null,null,{"$f":"IF(UPPER(E290)=\"OPCIONAL\", 10, \"\")","v":10},{"$f":"IF(UPPER(E290)=\"OPCIONAL\", H290, \"\")","v":0}]
["Computador completo PC /Computador Portátil","DIA_EQ_02",1,0,"Requerido",0,0,{"$f":"IF(AND(F291>=D291,F291>0,D291>0),10,0)","v":0},null,null,"EG",null,null,null,null,null,null,null,null,null,null,null,null,null,null,null,null,null,null,null,{"$f":"IF(UPPER(E291)=\"REQUERIDO\", 10, \"\")","v":10},{"$f":"IF(UPPER(E291)=\"REQUERIDO\", H291, \"\")","v":0}]
["Basurero con tapa y/o pedal",null,1,0,"Requerido",0,0,0,null,null,"MG",null,null,null,{"$f":"IF(UPPER(E292)=\"REQUERIDO\", 10, \"\")","v":10},{"$f":"IF(UPPER(E292)=\"REQUERIDO\", H292, \"\")","v":0}]
["Silla",null,1,0,"Requerido",0,0,0,null,null,"MG",null,null,null,{"$f":"IF(UPPER(E293)=\"REQUERIDO\", 10, \"\")","v":10},{"$f":"IF(UPPER(E293)=\"REQUERIDO\", H293, \"\")","v":0}]
["Zona de lavado de manos",{"$f":"B1","v":"Anx:"},{"$f":"C$1","v":"Cant x Espacio:"},"Requerido:","Tipo:","Funcional:","No Funcional:","Calif:","Observaciones:",{"$f":"Infraestructura!$F$105","v":0}]
["Dosificador de papel toalla",null,1,{"$f":"J294*C295","v":0},"Requerido",0,0,{"$f":"IF(AND(F295>=D295,F295>0,D295>0),10,0)","v":0},null,null,"MG",null,null,null,{"$f":"IF(UPPER(E295)=\"REQUERIDO\", 10, \"\")","v":10},{"$f":"IF(UPPER(E295)=\"REQUERIDO\", H295, \"\")","v":0}]
["Dosificador de jabón",null,1,{"$f":"J294*C296","v":0},"Requerido",0,0,0,null,null,"MG",null,null,null,10,0]
["Zona de refrigeradores y congeladores",{"$f":"B1","v":"Anx:"},{"$f":"C$1","v":"Cant x Espacio:"},"Requerido:","Tipo:","Funcional:","No Funcional:","Calif:","Observaciones:",{"$f":"Infraestructura!$F$106","v":0}]
["Refrigerador profesional  ",null,1,{"$f":"J297*C298","v":0},"Requerido",0,0,{"$f":"IF(AND(F298>=D298,F298>0,D298>0),10,0)","v":0},null,null,"EG",null,null,null,null,null,null,null,null,null,null,null,null,null,null,null,null,null,null,null,{"$f":"IF(UPPER(E298)=\"REQUERIDO\", 10, \"\")","v":10},{"$f":"IF(UPPER(E298)=\"REQUERIDO\", H298, \"\")","v":0}]
["Congelador",null,1,{"$f":"J297*C299","v":0},"Opcional",0,0,0,null,null,"EG",null,null,null,null,null,null,null,null,null,null,null,null,null,null,null,null,null,null,null,null,null,{"$f":"IF(UPPER(E299)=\"OPCIONAL\", 10, \"\")","v":10},{"$f":"IF(UPPER(E299)=\"OPCIONAL\", H299, \"\")","v":0}]
["INFORMÁTICA",null,null,null,null,null,null,null,null,null,null,null,null,null,null,null,null,null,null,null,null,null,null,null,null,null,null,null,null,null,null,null,null,null,null,null,null,null,null,null,null,null,null,null,null,null,{"$f":"SUM(O302:O310)","v":0},{"$f":"SUM(P301:P309)","v":0},{"$f":"SUM(Q302:Q310)","v":0},{"$f":"SUM(R301:R309)","v":0},{"$f":"SUM(S302:S310)","v":0},{"$f":"SUM(T301:T309)","v":0},{"$f":"SUM(U302:U310)","v":0},{"$f":"SUM(V301:V309)","v":0},{"$f":"SUM(W302:W310)","v":0},{"$f":"SUM(X301:X309)","v":0},{"$f":"SUM(Y302:Y310)","v":0},{"$f":"SUM(Z301:Z309)","v":0},{"$f":"SUM(AA302:AA310)","v":0},{"$f":"SUM(AB301:AB309)","v":0},{"$f":"SUM(AC302:AC310)","v":0},{"$f":"SUM(AD301:AD309)","v":0},{"$f":"SUM(AE302:AE310)","v":0},{"$f":"SUM(AF301:AF309)","v":0},{"$f":"SUM(AG302:AG310)","v":0},{"$f":"SUM(AH301:AH309)","v":0},{"$f":"SUM(AI302:AI310)","v":0},{"$f":"SUM(AJ301:AJ309)","v":0},{"$f":"SUM(AK302:AK310)","v":0},{"$f":"SUM(AL301:AL309)","v":0},{"$f":"SUM(AM302:AM310)","v":0},{"$f":"SUM(AN301:AN309)","v":0},{"$f":"SUM(AO302:AO310)","v":0},{"$f":"SUM(AP301:AP309)","v":0},{"$f":"SUM(AQ302:AQ310)","v":0},{"$f":"SUM(AR301:AR309)","v":0},{"$f":"SUM(AS302:AS310)","v":0},{"$f":"SUM(AT301:AT309)","v":0}]
["ÁREA TÉCNICA",null,null,null,null,null,null,null,null,null,null,null,null,null,null,null,null,null,null,null,null,null,null,null,null,null,null,null,null,null,null,null,null,null,null,null,null,null,null,null,null,null,null,null,null,null,{"$f":"SUM(O302:O309)","v":0},{"$f":"SUM(P302:P309)","v":0},{"$f":"SUM(Q302:Q309)","v":0},0,0,0,0,0,0,0,0,0,0,0,0,0,0,0,0,0,0,0,0,0,0,0,0,0,0,0,0,0]
["AMBIENTES",null,null,null,null,null,null,null,null,null,null,null,null,null,null,null,null,null,null,null,null,null,null,null,null,null,null,null,null,null,null,null,null,null,null,null,null,null,null,null,null,null,null,null,null,null,{"$f":"SUM(O303:O309)","v":0},{"$f":"SUM(P303:P309)","v":0},{"$f":"SUM(Q303:Q309)","v":0},0,0,0,0,0,0,0,0,0,0,0,0,0,0,0,0,0,0,0,0,0,0,0,0,0,0,0,0,0]
["Zona de trabajo ",{"$f":"B1","v":"Anx:"},{"$f":"C$1","v":"Cant x Espacio:"},"Requerido:","Tipo:","Funcional:","No Funcional:","Calif:","Observaciones:",{"$f":"Infraestructura!$F$113","v":0}]
["Mesa de trabajo  ","DIA_EQ_01",1,{"$f":"J303*C304","v":0},{"$f":"IF(D304>0, \"Requerido\", \"Sin Infraestructura\")","v":"Sin Infraestructura"},0,0,{"$f":"IF(AND(F304>=D304,F304>0,D304>0),10,0)","v":0},null,null,"MG",null,null,null,{"$f":"IF(UPPER(E304)=\"REQUERIDO\", 10, \"\")","v":""},{"$f":"IF(UPPER(E304)=\"REQUERIDO\", H304, \"\")","v":""}]
["Armario con cajones y estantes/Archivador",null,2,{"$f":"J303*C305","v":0},"Sin Infraestructura",0,0,0,null,null,"MG",null,null,null,"",""]
["Computador completo PC /Computador Portátil","DIA_EQ_02",1,{"$f":"J303*C306","v":0},"Sin Infraestructura",0,0,0,null,null,"EG",null,null,null,null,null,null,null,null,null,null,null,null,null,null,null,null,null,null,null,{"$f":"IF(UPPER(E306)=\"REQUERIDO\", 10, \"\")","v":""},{"$f":"IF(UPPER(E306)=\"REQUERIDO\", H306, \"\")","v":""}]
["Basurero con tapa y/o pedal",null,1,{"$f":"J303*C307","v":0},"Sin Infraestructura",0,0,0,null,null,"MG",null,null,null,{"$f":"IF(UPPER(E307)=\"REQUERIDO\", 10, \"\")","v":""},{"$f":"IF(UPPER(E307)=\"REQUERIDO\", H307, \"\")","v":""}]
["Perchero de pie",null,1,{"$f":"J303*C308","v":0},"Sin Infraestructura",0,0,0,null,null,"MG",null,null,null,"",""]
["Silla",null,1,{"$f":"J303*C309","v":0},"Sin Infraestructura",0,0,0,null,null,"MG",null,null,null,"",""]
["REGISTROS Y ARCHIVOS CLÍNICOS",null,null,null,null,null,null,null,null,null,null,null,null,null,null,null,null,null,null,null,null,null,null,null,null,null,null,null,null,null,null,null,null,null,null,null,null,null,null,null,null,null,null,null,null,null,{"$f":"SUM(O311:O327)","v":50},{"$f":"SUM(P311:P327)","v":0},{"$f":"SUM(Q311:Q327)","v":0},0,10,0,0,0,0,0,0,0,0,0,0,0,10,0,0,0,0,0,0,0,0,0,0,0,0,0,0,0]
["ÁREA DE ARCHIVO",null,null,null,null,null,null,null,null,null,null,null,null,null,null,null,null,null,null,null,null,null,null,null,null,null,null,null,null,null,null,null,null,null,null,null,null,null,null,null,null,null,null,null,null,null,{"$f":"SUM(O312:O314)","v":10},{"$f":"SUM(P312:P314)","v":0},{"$f":"SUM(Q312:Q314)","v":0},0,0,0,0,0,0,0,0,0,0,0,0,0,0,0,0,0,0,0,0,0,0,0,0,0,0,0,0,0]
["AMBIENTES",null,null,null,null,null,null,null,null,null,null,null,null,null,null,null,null,null,null,null,null,null,null,null,null,null,null,null,null,null,null,null,null,null,null,null,null,null,null,null,null,null,null,null,null,null,{"$f":"SUM(O313:O314)","v":10},{"$f":"SUM(P313:P314)","v":0},{"$f":"SUM(Q313:Q314)","v":0},0,0,0,0,0,0,0,0,0,0,0,0,0,0,0,0,0,0,0,0,0,0,0,0,0,0,0,0,0]
["Archivo de historias",{"$f":"B1","v":"Anx:"},{"$f":"C$1","v":"Cant x Espacio:"},"Requerido:","Tipo:","Funcional:","No Funcional:","Calif:","Observaciones:",{"$f":"Infraestructura!$F$121","v":0}]
["Estantería básica",null,2,{"$f":"J313*C314","v":0},"Requerido",0,0,{"$f":"IF(AND(F314>=D314,F314>0,D314>0),10,0)","v":0},null,null,"MG",null,null,null,{"$f":"IF(UPPER(E314)=\"REQUERIDO\", 10, \"\")","v":10},{"$f":"IF(UPPER(E314)=\"REQUERIDO\", H314, \"\")","v":0}]
["ÁREA TÉCNICA",null,null,null,null,null,null,null,null,null,null,null,null,null,null,null,null,null,null,null,null,null,null,null,null,null,null,null,null,null,null,null,null,null,null,null,null,null,null,null,null,null,null,null,null,null,{"$f":"SUM(O316:O327)","v":40},{"$f":"SUM(P316:P327)","v":0},{"$f":"SUM(Q316:Q327)","v":0},0,10,0,0,0,0,0,0,0,0,0,0,0,10,0,0,0,0,0,0,0,0,0,0,0,0,0,0,0]
["AMBIENTES",null,null,null,null,null,null,null,null,null,null,null,null,null,null,null,null,null,null,null,null,null,null,null,null,null,null,null,null,null,null,null,null,null,null,null,null,null,null,null,null,null,null,null,null,null,{"$f":"SUM(O317:O327)","v":40},{"$f":"SUM(P317:P327)","v":0},{"$f":"SUM(Q317:Q327)","v":0},0,10,0,0,0,0,0,0,0,0,0,0,0,10,0,0,0,0,0,0,0,0,0,0,0,0,0,0,0]
["Escaneado ",{"$f":"B1","v":"Anx:"},{"$f":"C$1","v":"Cant x Espacio:"},"Requerido:","Tipo:","Funcional:","No Funcional:","Calif:","Observaciones:",{"$f":"Infraestructura!$F$127","v":0}]
["Mesa  de apoyo",null,1,{"$f":"J317*C318","v":0},{"$f":"IF(D318>0, \"Requerido\", \"Sin Infraestructura\")","v":"Sin Infraestructura"},0,0,{"$f":"IF(AND(F318>=D318,F318>0,D318>0),10,0)","v":0},null,null,"MG",null,null,null,{"$f":"IF(UPPER(E318)=\"REQUERIDO\", 10, \"\")","v":""},{"$f":"IF(UPPER(E318)=\"REQUERIDO\", H318, \"\")","v":""}]
["Escáner ",null,1,{"$f":"J317*C319","v":0},{"$f":"IF(D319>0, \"Requerido\", \"Sin Infraestructura\")","v":"Sin Infraestructura"},0,0,{"$f":"IF(AND(F319>=D319,F319>0,D319>0),10,0)","v":0},null,null,"EG",null,null,null,null,null,null,null,null,null,null,null,null,null,null,null,null,null,null,null,{"$f":"IF(UPPER(E319)=\"REQUERIDO\", 10, \"\")","v":""},{"$f":"IF(UPPER(E319)=\"REQUERIDO\", H319, \"\")","v":""}]
["Estantería básica",null,2,{"$f":"J317*C320","v":0},{"$f":"IF(D320>0, \"Requerido\", \"Sin Infraestructura\")","v":"Sin Infraestructura"},0,0,{"$f":"IF(AND(F320>=D320,F320>0,D320>0),10,0)","v":0},null,null,"MG",null,null,null,{"$f":"IF(UPPER(E320)=\"REQUERIDO\", 10, \"\")","v":""},{"$f":"IF(UPPER(E320)=\"REQUERIDO\", H320, \"\")","v":""}]
["Zona de trabajo ",{"$f":"B1","v":"Anx:"},{"$f":"C$1","v":"Cant x Espacio:"},"Requerido:","Tipo:","Funcional:","No Funcional:","Calif:","Observaciones:",{"$f":"Infraestructura!$F$128","v":0}]
["Mesa de trabajo  ","DIA_EQ_01",1,{"$f":"J321*C322","v":0},"Requerido",0,0,{"$f":"IF(AND(F322>=D322,F322>0,D322>0),10,0)","v":0},null,null,"MG",null,null,null,{"$f":"IF(UPPER(E322)=\"REQUERIDO\", 10, \"\")","v":10},{"$f":"IF(UPPER(E322)=\"REQUERIDO\", H322, \"\")","v":0}]
["Armario con cajones y estantes/Archivador",null,1,{"$f":"J321*C323","v":0},"Requerido",0,0,0,null,null,"MG",null,null,null,10,0]
["Computador completo PC /Computador Portátil","DIA_EQ_02",2,{"$f":"J321*C324","v":0},"Requerido",0,0,0,null,null,"EG",null,null,null,null,null,null,null,null,null,null,null,null,null,null,null,null,null,null,null,{"$f":"IF(UPPER(E324)=\"REQUERIDO\", 10, \"\")","v":10},{"$f":"IF(UPPER(E324)=\"REQUERIDO\", H324, \"\")","v":0}]
["Basurero con tapa y/o pedal",null,2,{"$f":"J321*C325","v":0},"Requerido",0,0,0,null,null,"MG",null,null,null,{"$f":"IF(UPPER(E325)=\"REQUERIDO\", 10, \"\")","v":10},{"$f":"IF(UPPER(E325)=\"REQUERIDO\", H325, \"\")","v":0}]
["Perchero de pie",null,1,{"$f":"J321*C326","v":0},"Deseable",0,0,0,null,null,"MG",null,null,null,null,null,null,null,{"$f":"IF(UPPER(E326)=\"DESEABLE\", 10, 0)","v":10},{"$f":"IF(UPPER(E326)=\"DESEABLE\", H326, \"\")","v":0}]
["Silla",null,2,{"$f":"J321*C327","v":0},"Requerido",0,0,0,null,null,"MG",null,null,null,10,0]
["SERVICIO DE ADMINISTRACIÓN",null,null,null,null,null,null,null,null,null,null,null,null,null,null,null,null,null,null,null,null,null,null,null,null,null,null,null,null,null,null,null,null,null,null,null,null,null,null,null,null,null,null,null,null,null,{"$f":"SUM(O329:O404)","v":210},{"$f":"SUM(P329:P404)","v":0},{"$f":"SUM(Q329:Q404)","v":0},0,30,{"$f":"SUM(T329:T404)","v":0},0,0,{"$f":"SUM(W329:W404)","v":30},0,0,{"$f":"SUM(Z329:Z404)","v":0},0,0,{"$f":"SUM(AC329:AC404)","v":0},0,10,{"$f":"SUM(AF329:AF404)","v":0},0,0,{"$f":"SUM(AI329:AI404)","v":0},0,0,{"$f":"SUM(AL329:AL404)","v":0},10,0,{"$f":"SUM(AO329:AO404)","v":0},0,0,{"$f":"SUM(AR329:AR404)","v":0},0,0]
["DIRECCIÓN Y GESTIÓN ADMINISTRATIVA",null,null,null,null,null,null,null,null,null,null,null,null,null,null,null,null,null,null,null,null,null,null,null,null,null,null,null,null,null,null,null,null,null,null,null,null,null,null,null,null,null,null,null,null,null,{"$f":"SUM(O331:O404)","v":210},{"$f":"SUM(P331:P404)","v":0},{"$f":"SUM(Q331:Q404)","v":0},0,30,0,0,0,30,0,0,0,0,0,0,0,10,0,0,0,0,0,0,0,10,0,0,0,0,0,0,0]
["DIRECCIÓN",null,null,null,null,null,null,null,null,null,null,null,null,null,null,null,null,null,null,null,null,null,null,null,null,null,null,null,null,null,null,null,null,null,null,null,null,null,null,null,null,null,null,null,null,null,{"$f":"SUM(O331:O359)","v":130},{"$f":"SUM(P331:P359)","v":0},{"$f":"SUM(Q331:Q359)","v":0},0,20,{"$f":"SUM(T331:T359)","v":0},0,0,{"$f":"SUM(W331:W359)","v":30},0,0,{"$f":"SUM(Z331:Z359)","v":0},0,0,{"$f":"SUM(AC331:AC359)","v":0},0,10,{"$f":"SUM(AF331:AF359)","v":0},0,0,{"$f":"SUM(AI331:AI359)","v":0},0,0,{"$f":"SUM(AL331:AL359)","v":0},10,0,{"$f":"SUM(AO331:AO359)","v":0},0,0,{"$f":"SUM(AR331:AR359)","v":0},0,0]
["AMBIENTES",null,null,null,null,null,null,null,null,null,null,null,null,null,null,null,null,null,null,null,null,null,null,null,null,null,null,null,null,null,null,null,null,null,null,null,null,null,null,null,null,null,null,null,null,null,{"$f":"SUM(O332:O359)","v":130},{"$f":"SUM(P332:P359)","v":0},{"$f":"SUM(Q332:Q359)","v":0},0,20,{"$f":"SUM(T332:T359)","v":0},0,0,{"$f":"SUM(W332:W359)","v":30},0,0,{"$f":"SUM(Z332:Z359)","v":0},0,0,{"$f":"SUM(AC332:AC359)","v":0},0,10,{"$f":"SUM(AF332:AF359)","v":0},0,0,{"$f":"SUM(AI332:AI359)","v":0},0,0,{"$f":"SUM(AL332:AL359)","v":0},10,0,{"$f":"SUM(AO332:AO359)","v":0},0,0,{"$f":"SUM(AR332:AR359)","v":0},0,0]
["Despacho de Director",{"$f":"B1","v":"Anx:"},{"$f":"C$1","v":"Cant x Espacio:"},"Requerido:","Tipo:","Funcional:","No Funcional:","Calif:","Observaciones:",{"$f":"Infraestructura!F136","v":0}]
["Mesa de despacho con ala ejecutiva","DIA_EQ_01",1,{"$f":"$J$332*C333","v":0},{"$f":"IF(D333>0, \"Requerido\", \"Sin Infraestructura\")","v":"Sin Infraestructura"},0,0,{"$f":"IF(AND(F333>=D333,F333>0,D333>0),10,0)","v":0},null,null,"MG",null,null,null,{"$f":"IF(UPPER(E333)=\"REQUERIDO\", 10, \"\")","v":""},{"$f":"IF(UPPER(E333)=\"REQUERIDO\", H333, \"\")","v":""}]
["Archivador",null,1,{"$f":"$J$332*C334","v":0},"Requerido",0,0,{"$f":"IF(AND(F334>=D334,F334>0,D334>0),10,0)","v":0},null,null,"MM",null,null,null,null,null,null,null,null,null,null,null,{"$f":"IF(UPPER(E334)=\"REQUERIDO\", 10, \"\")","v":10},{"$f":"IF(UPPER(E334)=\"REQUERIDO\", H334, \"\")","v":0}]
["Mesa de reuniones",null,1,0,"Deseable",0,0,{"$f":"IF(AND(F335>=D335,F335>0,D335>0),10,0)","v":0},null,null,"MG",null,null,null,{"$f":"IF(UPPER(E335)=\"REQUERIDO\", 10, \"\")","v":""},{"$f":"IF(UPPER(E335)=\"REQUERIDO\", H335, \"\")","v":""},null,null,{"$f":"IF(UPPER(E335)=\"DESEABLE\", 10, 0)","v":10},{"$f":"IF(UPPER(E335)=\"DESEABLE\", H335, \"\")","v":0}]
["Computador completo PC /Computador Portátil","DIA_EQ_02",1,0,"Requerido",0,0,{"$f":"IF(AND(F336>=D336,F336>0,D336>0),10,0)","v":0},null,null,"EM",null,null,null,null,null,null,null,null,null,null,null,null,null,null,null,null,null,null,null,null,null,null,null,null,null,null,null,{"$f":"IF(UPPER(E336)=\"REQUERIDO\", 10, \"\")","v":10},{"$f":"IF(UPPER(E336)=\"REQUERIDO\", H336, \"\")","v":0}]
["Basurero con tapa y/o pedal",null,1,0,"Requerido",0,0,{"$f":"IF(AND(F337>=D337,F337>0,D337>0),10,0)","v":0},null,null,"MG",null,null,null,{"$f":"IF(UPPER(E337)=\"REQUERIDO\", 10, \"\")","v":10},{"$f":"IF(UPPER(E337)=\"REQUERIDO\", H337, \"\")","v":0}]
["Perchero de pie",null,1,0,"Requerido",0,0,0,null,null,"MG",null,null,null,10,0]
["Silla confidente",null,2,0,"Requerido",0,0,0,null,null,"MG",null,null,null,10,0]
["Sillón de gerencia",null,1,0,"Requerido",0,0,0,null,null,"MG",null,null,null,10,0]
["Silla",null,4,0,"Deseable",0,0,{"$f":"IF(AND(F341>=D341,F341>0,D341>0),10,0)","v":0},null,null,"MG",null,null,null,null,null,null,null,{"$f":"IF(UPPER(E341)=\"DESEABLE\", 10, 0)","v":10},{"$f":"IF(UPPER(E341)=\"DESEABLE\", H341, \"\")","v":0}]
["Sala de espera",{"$f":"B1","v":"Anx:"},{"$f":"C$1","v":"Cant x Espacio:"},"Requerido:","Tipo:","Funcional:","No Funcional:","Calif:","Observaciones:",{"$f":"Infraestructura!F137","v":0}]
["Bancas / individuales/3 puestos/ 4 puestos",null,3,{"$f":"$J$342*C343","v":0},{"$f":"IF(D343>0, \"Requerido\", \"Sin Infraestructura\")","v":"Sin Infraestructura"},0,0,{"$f":"IF(AND(F343>=D343,F343>0,D343>0),10,0)","v":0},null,null,"MM",null,null,null,null,null,null,null,null,null,null,null,{"$f":"IF(UPPER(E343)=\"REQUERIDO\", 10, \"\")","v":""},{"$f":"IF(UPPER(E343)=\"REQUERIDO\", H343, \"\")","v":""}]
["Basurero con tapa y/o pedal",null,1,{"$f":"$J$342*C344","v":0},{"$f":"IF(D344>0, \"Requerido\", \"Sin Infraestructura\")","v":"Sin Infraestructura"},0,0,{"$f":"IF(AND(F344>=D344,F344>0,D344>0),10,0)","v":0},null,null,"MG",null,null,null,{"$f":"IF(UPPER(E344)=\"REQUERIDO\", 10, \"\")","v":""},{"$f":"IF(UPPER(E344)=\"REQUERIDO\", H344, \"\")","v":""}]
["Reloj de pared",null,1,{"$f":"$J$342*C345","v":0},{"$f":"IF(D345>0, \"Requerido\", \"Sin Infraestructura\")","v":"Sin Infraestructura"},0,0,{"$f":"IF(AND(F345>=D345,F345>0,D345>0),10,0)","v":0},null,null,"MG",null,null,null,"",""]
["Secretaría",{"$f":"B1","v":"Anx:"},{"$f":"C$1","v":"Cant x Espacio:"},"Requerido:","Tipo:","Funcional:","No Funcional:","Calif:","Observaciones:",{"$f":"Infraestructura!F138","v":0}]
["Mesa de despacho con ala para ordenador","DIA_EQ_01",1,{"$f":"$J$346*C347","v":0},"Requerido",0,0,{"$f":"IF(AND(F347>=D347,F347>0,D347>0),10,0)","v":0},null,null,"MG",null,null,null,{"$f":"IF(UPPER(E347)=\"REQUERIDO\", 10, \"\")","v":10},{"$f":"IF(UPPER(E347)=\"REQUERIDO\", H347, \"\")","v":0}]
["Archivador ",null,1,{"$f":"$J$346*C348","v":0},"Requerido",0,0,{"$f":"IF(AND(F348>=D348,F348>0,D348>0),10,0)","v":0},null,null,"MM",null,null,null,null,null,null,null,null,null,null,null,{"$f":"IF(UPPER(E348)=\"REQUERIDO\", 10, \"\")","v":10},{"$f":"IF(UPPER(E348)=\"REQUERIDO\", H348, \"\")","v":0}]
["Basurero con tapa y/o pedal",null,1,0,"Requerido",0,0,{"$f":"IF(AND(F349>=D349,F349>0,D349>0),10,0)","v":0},null,null,"MG",null,null,null,{"$f":"IF(UPPER(E349)=\"REQUERIDO\", 10, \"\")","v":10},{"$f":"IF(UPPER(E349)=\"REQUERIDO\", H349, \"\")","v":0}]
["Perchero de pie",null,1,0,"Requerido",0,0,{"$f":"IF(AND(F350>=D350,F350>0,D350>0),10,0)","v":0},null,null,"MG",null,null,null,10,0]
["Silla confidente",null,2,0,"Requerido",0,0,{"$f":"IF(AND(F351>=D351,F351>0,D351>0),10,0)","v":0},null,null,"MG",null,null,null,10,0]
["Silla",null,1,0,"Requerido",0,0,0,null,null,"MG",null,null,null,10,0]
["Despacho de Jefe de Enfermeras",{"$f":"B8","v":"Anx:"},{"$f":"C$1","v":"Cant x Espacio:"},"Requerido:","Tipo:","Funcional:","No Funcional:","Calif:","Observaciones:",{"$f":"Infraestructura!F139","v":0}]
["Mesa de despacho con ala para ordenador","DIA_EQ_01",1,{"$f":"$J$353*C354","v":0},"Requerido",0,0,{"$f":"IF(AND(F354>=D354,F354>0,D354>0),10,0)","v":0},null,null,"MG",null,null,null,{"$f":"IF(UPPER(E354)=\"REQUERIDO\", 10, \"\")","v":10},{"$f":"IF(UPPER(E354)=\"REQUERIDO\", H354, \"\")","v":0}]
["Archivador",null,1,{"$f":"$J$353*C355","v":0},"Requerido",0,0,{"$f":"IF(AND(F355>=D355,F355>0,D355>0),10,0)","v":0},null,null,"MM",null,null,null,null,null,null,null,null,null,null,null,{"$f":"IF(UPPER(E355)=\"REQUERIDO\", 10, \"\")","v":10},{"$f":"IF(UPPER(E355)=\"REQUERIDO\", H355, \"\")","v":0}]
["Computador completo PC /Computador Portátil","DIA_EQ_02",1,0,"Requerido",0,0,{"$f":"IF(AND(F356>=D356,F356>0,D356>0),10,0)","v":0},null,null,"EG",null,null,null,null,null,null,null,null,null,null,null,null,null,null,null,null,null,null,null,{"$f":"IF(UPPER(E356)=\"REQUERIDO\", 10, \"\")","v":10},{"$f":"IF(UPPER(E356)=\"REQUERIDO\", H356, \"\")","v":0}]
["Basurero con tapa y/o pedal",null,1,0,"Requerido",0,0,{"$f":"IF(AND(F357>=D357,F357>0,D357>0),10,0)","v":0},null,null,"MG",null,null,null,{"$f":"IF(UPPER(E357)=\"REQUERIDO\", 10, \"\")","v":10},{"$f":"IF(UPPER(E357)=\"REQUERIDO\", H357, \"\")","v":0}]
["Gancho doble",null,1,0,"Requerido",0,0,{"$f":"IF(AND(F358>=D358,F358>0,D358>0),10,0)","v":0},null,null,"MG",null,null,null,10,0]
["Silla",null,3,{"$f":"$J$332*C359","v":0},"Requerido",0,0,0,null,null,"MG",null,null,null,10,0]
["DIRECCIÓN DE TALENTO HUMANO",null,null,null,null,null,null,null,null,null,null,null,null,null,null,null,null,null,null,null,null,null,null,null,null,null,null,null,null,null,null,null,null,null,null,null,null,null,null,null,null,null,null,null,null,null,{"$f":"SUM(O361:O369)","v":0},{"$f":"SUM(P361:P369)","v":0},{"$f":"SUM(Q361:Q369)","v":0},0,0,0,0,0,0,0,0,0,0,0,0,0,0,0,0,0,0,0,0,0,0,0,0,0,0,0,0,0]
["AMBIENTES",null,null,null,null,null,null,null,null,null,null,null,null,null,null,null,null,null,null,null,null,null,null,null,null,null,null,null,null,null,null,null,null,null,null,null,null,null,null,null,null,null,null,null,null,null,{"$f":"SUM(O361:O369)","v":0},{"$f":"SUM(P362:P369)","v":0},{"$f":"SUM(Q361:Q369)","v":0},0,{"$f":"SUM(S362:S369)","v":0},{"$f":"SUM(T361:T369)","v":0},0,{"$f":"SUM(V362:V369)","v":0},{"$f":"SUM(W361:W369)","v":0},0,{"$f":"SUM(Y362:Y369)","v":0},{"$f":"SUM(Z361:Z369)","v":0},0,{"$f":"SUM(AB362:AB369)","v":0},{"$f":"SUM(AC361:AC369)","v":0},0,{"$f":"SUM(AE362:AE369)","v":0},{"$f":"SUM(AF361:AF369)","v":0},0,{"$f":"SUM(AH362:AH369)","v":0},{"$f":"SUM(AI361:AI369)","v":0},0,{"$f":"SUM(AK362:AK369)","v":0},{"$f":"SUM(AL361:AL369)","v":0},0,{"$f":"SUM(AN362:AN369)","v":0},{"$f":"SUM(AO361:AO369)","v":0},0,{"$f":"SUM(AQ362:AQ369)","v":0},{"$f":"SUM(AR361:AR369)","v":0},0,{"$f":"SUM(AT362:AT369)","v":0}]
["Despacho de Responsable",{"$f":"B1","v":"Anx:"},{"$f":"C$1","v":"Cant x Espacio:"},"Requerido:","Tipo:","Funcional:","No Funcional:","Calif:","Observaciones:",{"$f":"Infraestructura!F145","v":0}]
["Mesa de despacho con ala para ordenador","DIA_EQ_01",1,{"$f":"$J$362*C363","v":0},{"$f":"IF(D363>0, \"Requerido\", \"Sin Infraestructura\")","v":"Sin Infraestructura"},0,0,{"$f":"IF(AND(F363>=D363,F363>0,D363>0),10,0)","v":0},null,null,"MG",null,null,null,{"$f":"IF(UPPER(E363)=\"REQUERIDO\", 10, \"\")","v":""},{"$f":"IF(UPPER(E363)=\"REQUERIDO\", H363, \"\")","v":""}]
["Archivador",null,1,{"$f":"$J$362*C364","v":0},"Sin Infraestructura",0,0,0,null,null,"MG",null,null,null,"",""]
["Computador completo PC /Computador Portátil","DIA_EQ_02",1,0,"Sin Infraestructura",0,0,0,null,null,"EG",null,null,null,null,null,null,null,null,null,null,null,null,null,null,null,null,null,null,null,{"$f":"IF(UPPER(E365)=\"REQUERIDO\", 10, \"\")","v":""},{"$f":"IF(UPPER(E365)=\"REQUERIDO\", H365, \"\")","v":""}]
["Basurero con tapa y/o pedal",null,1,0,"Sin Infraestructura",0,0,0,null,null,"MG",null,null,null,{"$f":"IF(UPPER(E366)=\"REQUERIDO\", 10, \"\")","v":""},{"$f":"IF(UPPER(E366)=\"REQUERIDO\", H366, \"\")","v":""}]
["Gancho doble",null,1,0,"Sin Infraestructura",0,0,0,null,null,"MG",null,null,null,"",""]
["Silla confidente",null,2,0,"Sin Infraestructura",0,0,0,null,null,"MG",null,null,null,"",""]
["Silla",null,1,0,"Sin Infraestructura",0,0,0,null,null,"MG",null,null,null,"",""]
["DIRECCIÓN ADMINISTRATIVO-FINANCIERA",null,null,null,null,null,null,null,null,null,null,null,null,null,null,null,null,null,null,null,null,null,null,null,null,null,null,null,null,null,null,null,null,null,null,null,null,null,null,null,null,null,null,null,null,null,{"$f":"SUM(O371:O378)","v":0},{"$f":"SUM(P371:P378)","v":0},{"$f":"SUM(Q371:Q378)","v":0},0,0,0,0,0,0,0,0,0,0,0,0,0,0,0,0,0,0,0,0,0,0,0,0,0,0,0,0,0]
["AMBIENTES",null,null,null,null,null,null,null,null,null,null,null,null,null,null,null,null,null,null,null,null,null,null,null,null,null,null,null,null,null,null,null,null,null,null,null,null,null,null,null,null,null,null,null,null,null,{"$f":"SUM(O371:O378)","v":0},{"$f":"SUM(P372:P378)","v":0},{"$f":"SUM(Q371:Q378)","v":0},{"$f":"SUM(R372:R378)","v":0},{"$f":"SUM(S371:S378)","v":0},{"$f":"SUM(T372:T378)","v":0},{"$f":"SUM(U371:U378)","v":0},{"$f":"SUM(V372:V378)","v":0},{"$f":"SUM(W371:W378)","v":0},{"$f":"SUM(X372:X378)","v":0},{"$f":"SUM(Y371:Y378)","v":0},{"$f":"SUM(Z372:Z378)","v":0},{"$f":"SUM(AA371:AA378)","v":0},{"$f":"SUM(AB372:AB378)","v":0},{"$f":"SUM(AC371:AC378)","v":0},{"$f":"SUM(AD372:AD378)","v":0},{"$f":"SUM(AE371:AE378)","v":0},{"$f":"SUM(AF372:AF378)","v":0},{"$f":"SUM(AG371:AG378)","v":0},{"$f":"SUM(AH372:AH378)","v":0},{"$f":"SUM(AI371:AI378)","v":0},{"$f":"SUM(AJ372:AJ378)","v":0},{"$f":"SUM(AK371:AK378)","v":0},{"$f":"SUM(AL372:AL378)","v":0},{"$f":"SUM(AM371:AM378)","v":0},{"$f":"SUM(AN372:AN378)","v":0},{"$f":"SUM(AO371:AO378)","v":0},{"$f":"SUM(AP372:AP378)","v":0},{"$f":"SUM(AQ371:AQ378)","v":0},{"$f":"SUM(AR372:AR378)","v":0},{"$f":"SUM(AS371:AS378)","v":0},{"$f":"SUM(AT372:AT378)","v":0}]
["Zona de trabajo de Técnico financiero",{"$f":"B1","v":"Anx:"},{"$f":"C$1","v":"Cant x Espacio:"},"Requerido:","Tipo:","Funcional:","No Funcional:","Calif:","Observaciones:",{"$f":"Infraestructura!F151","v":0}]
["Mesa de despacho con ala para ordenador","DIA_EQ_01",1,{"$f":"$J$372*C373","v":0},{"$f":"IF(D373>0, \"Requerido\", \"Sin Infraestructura\")","v":"Sin Infraestructura"},0,0,{"$f":"IF(AND(F373>=D373,F373>0,D373>0),10,0)","v":0},null,null,"MG",null,null,null,{"$f":"IF(UPPER(E373)=\"REQUERIDO\", 10, \"\")","v":""},{"$f":"IF(UPPER(E373)=\"REQUERIDO\", H373, \"\")","v":""}]
["Archivador",null,1,{"$f":"$J$372*C374","v":0},"Sin Infraestructura",0,0,0,null,null,"MG",null,null,null,"",""]
["Computador completo PC /Computador Portátil","DIA_EQ_02",1,0,"Sin Infraestructura",0,0,0,null,null,"EG",null,null,null,null,null,null,null,null,null,null,null,null,null,null,null,null,null,null,null,{"$f":"IF(UPPER(E375)=\"REQUERIDO\", 10, \"\")","v":""},{"$f":"IF(UPPER(E375)=\"REQUERIDO\", H375, \"\")","v":""}]
["Basurero con tapa y/o pedal",null,1,0,"Sin Infraestructura",0,0,0,null,null,"MG",null,null,null,{"$f":"IF(UPPER(E376)=\"REQUERIDO\", 10, \"\")","v":""},{"$f":"IF(UPPER(E376)=\"REQUERIDO\", H376, \"\")","v":""}]
["Gancho doble",null,1,0,"Sin Infraestructura",0,0,0,null,null,"MG",null,null,null,"",""]
["Silla",null,1,0,"Sin Infraestructura",0,0,0,null,null,"MG",null,null,null,"",""]
["ZONA DE APOYO DE LA DIRECCIÓN ",null,null,null,null,null,null,null,null,null,null,null,null,null,null,null,null,null,null,null,null,null,null,null,null,null,null,null,null,null,null,null,null,null,null,null,null,null,null,null,null,null,null,null,null,null,{"$f":"SUM(O380:O404)","v":80},{"$f":"SUM(P380:P404)","v":0},{"$f":"SUM(Q380:Q404)","v":0},0,10,0,0,0,0,0,0,0,0,0,0,0,0,0,0,0,0,0,0,0,0,0,0,0,0,0,0,0]
["AMBIENTES",null,null,null,null,null,null,null,null,null,null,null,null,null,null,null,null,null,null,null,null,null,null,null,null,null,null,null,null,null,null,null,null,null,null,null,null,null,null,null,null,null,null,null,null,null,{"$f":"SUM(O381:O404)","v":80},{"$f":"SUM(P381:P404)","v":0},{"$f":"SUM(Q381:Q404)","v":0},0,10,0,0,0,0,0,0,0,0,0,0,0,0,0,0,0,0,0,0,0,0,0,0,0,0,0,0,0]
["Baño de personal",{"$f":"B1","v":"Anx:"},{"$f":"C$1","v":"Cant x Espacio:"},"Requerido:","Tipo:","Funcional:","No Funcional:","Calif:","Observaciones:",{"$f":"Infraestructura!F157","v":0}]
["Dosificador de jabón",null,1,{"$f":"$J$381*C382","v":0},"Requerido",0,0,{"$f":"IF(AND(F382>=D382,F382>0,D382>0),10,0)","v":0},null,null,null,null,null,null,{"$f":"IF(UPPER(E382)=\"REQUERIDO\", 10, \"\")","v":10},{"$f":"IF(UPPER(E382)=\"REQUERIDO\", H382, \"\")","v":0}]
["Dispensador de papel toalla",null,1,{"$f":"$J$381*C383","v":0},"Requerido",0,0,0,null,null,"MG",null,null,null,{"$f":"IF(UPPER(E383)=\"REQUERIDO\", 10, \"\")","v":10},{"$f":"IF(UPPER(E383)=\"REQUERIDO\", H383, \"\")","v":0}]
["Dispensador papel higiénico",null,1,0,"Requerido",0,0,0,null,null,"MG",null,null,null,10,0]
["Espejo empotrado ",null,1,0,"Requerido",0,0,0,null,null,"MG",null,null,null,10,0]
["Gancho doble",null,1,0,"Requerido",0,0,0,null,null,"MG",null,null,null,10,0]
["Juego de ayudas técnicas",null,1,0,"Requerido",0,0,0,null,null,"MG",null,null,null,10,0]
["Lavabo ",null,1,0,"Requerido",0,0,0,null,null,"MG",null,null,null,10,0]
["Basurero con tapa y/o pedal",null,1,0,"Requerido",0,0,0,null,null,"MG",null,null,null,10,0]
["Juego de ayudas técnicas",null,1,0,"Deseable",0,0,0,null,null,"MG",null,null,null,null,null,null,null,{"$f":"IF(UPPER(E390)=\"DESEABLE\", 10, \"\")","v":10},{"$f":"IF(UPPER(E390)=\"DESEABLE\", H390, \"\")","v":0}]
["Cafetería",{"$f":"B1","v":"Anx:"},{"$f":"C$1","v":"Cant x Espacio:"},"Requerido:","Tipo:","Funcional:","No Funcional:","Calif:","Observaciones:",{"$f":"Infraestructura!F158","v":0},"MG"]
["Mesa",null,1,{"$f":"$J$391*C392","v":0},{"$f":"IF(D392>0, \"Requerido\", \"Sin Infraestructura\")","v":"Sin Infraestructura"},0,0,{"$f":"IF(AND(F392>=D392,F392>0,D392>0),10,0)","v":0}]
["Cafetera ",null,1,{"$f":"$J$391*C393","v":0},"Sin Infraestructura",0,0,0,null,null,"MG",null,null,null,{"$f":"IF(UPPER(E393)=\"REQUERIDO\", 10, \"\")","v":""},{"$f":"IF(UPPER(E393)=\"REQUERIDO\", H393, \"\")","v":""}]
["Gancho doble",null,1,0,"Sin Infraestructura",0,0,0,null,null,"EG",null,null,null,null,null,null,null,null,null,null,null,null,null,null,null,null,null,null,null,{"$f":"IF(UPPER(E394)=\"REQUERIDO\", 10, \"\")","v":""},{"$f":"IF(UPPER(E394)=\"REQUERIDO\", H394, \"\")","v":""}]
["Mesón con Lavabo",null,1,0,"Sin Infraestructura",0,0,0,null,null,"MG",null,null,null,{"$f":"IF(UPPER(E395)=\"REQUERIDO\", 10, \"\")","v":""},{"$f":"IF(UPPER(E395)=\"REQUERIDO\", H395, \"\")","v":""}]
["Microondas",null,1,0,"Sin Infraestructura",0,0,0,null,null,"MG",null,null,null,"",""]
["Silla",null,4,0,"Sin Infraestructura",0,0,0,null,null,"EG",null,null,null,null,null,null,null,null,null,null,null,null,null,null,null,null,null,null,null,{"$f":"IF(UPPER(E397)=\"REQUERIDO\", 10, \"\")","v":""},{"$f":"IF(UPPER(E397)=\"REQUERIDO\", H397, \"\")","v":""}]
["Sala de reuniones",{"$f":"B1","v":"Anx:"},{"$f":"C$1","v":"Cant x Espacio:"},"Requerido:","Tipo:","Funcional:","No Funcional:","Calif:","Observaciones:",{"$f":"Infraestructura!F159","v":0},"MG",null,null,null,{"$f":"IF(UPPER(E398)=\"REQUERIDO\", 10, \"\")","v":""},{"$f":"IF(UPPER(E398)=\"REQUERIDO\", H398, \"\")","v":""}]
["Mesa de reuniones",null,1,{"$f":"$J$398*C399","v":0},{"$f":"IF(D399>0, \"Requerido\", \"Sin Infraestructura\")","v":"Sin Infraestructura"},0,0,{"$f":"IF(AND(F399>=D399,F399>0,D399>0),10,0)","v":0}]
["Computador completo PC /Computador Portátil","DIA_EQ_02",1,{"$f":"$J$398*C400","v":0},"Sin Infraestructura",0,0,0,null,null,"MG",null,null,null,{"$f":"IF(UPPER(E400)=\"REQUERIDO\", 10, \"\")","v":""},{"$f":"IF(UPPER(E400)=\"REQUERIDO\", H400, \"\")","v":""}]
["Mueble para computadora",null,1,0,"Sin Infraestructura",0,0,0,null,null,"EG",null,null,null,null,null,null,null,null,null,null,null,null,null,null,null,null,null,null,null,{"$f":"IF(UPPER(E401)=\"REQUERIDO\", 10, \"\")","v":""},{"$f":"IF(UPPER(E401)=\"REQUERIDO\", H401, \"\")","v":""}]
["Proyector multimedia",null,1,0,"Sin Infraestructura",0,0,0,null,null,"MG",null,null,null,{"$f":"IF(UPPER(E402)=\"REQUERIDO\", 10, \"\")","v":""},{"$f":"IF(UPPER(E402)=\"REQUERIDO\", H402, \"\")","v":""}]
["Silla",null,1,0,"Sin Infraestructura",0,0,0,null,null,"EG",null,null,null,null,null,null,null,null,null,null,null,null,null,null,null,null,null,null,null,{"$f":"IF(UPPER(E403)=\"REQUERIDO\", 10, \"\")","v":""},{"$f":"IF(UPPER(E403)=\"REQUERIDO\", H403, \"\")","v":""}]
["Archivador",null,1,0,"Sin Infraestructura",0,0,0,null,null,"MG",null,null,null,{"$f":"IF(UPPER(E404)=\"REQUERIDO\", 10, \"\")","v":""},{"$f":"IF(UPPER(E404)=\"REQUERIDO\", H404, \"\")","v":""}]
["SERVICIOS GENERALES",null,null,null,null,null,null,null,null,null,"MG",null,null,null,"","",null,null,null,null,null,null,null,null,null,null,null,null,null,null,null,null,null,null,null,null,null,null,null,null,null,null,null,null,null,null,{"$f":"SUM(O406:O468)","v":280},{"$f":"SUM(P406:P468)","v":0},{"$f":"SUM(Q406:Q468)","v":0},0,0,0,0,0,0,0,0,0,0,0,0,0,0,0,0,0,0,0,0,0,0,0,0,0,0,0,0,0]
["BODEGA",null,null,null,null,null,null,null,null,null,null,null,null,null,null,null,null,null,null,null,null,null,null,null,null,null,null,null,null,null,null,null,null,null,null,null,null,null,null,null,null,null,null,null,null,null,{"$f":"SUM(O407:O420)","v":30},{"$f":"SUM(P407:P420)","v":0},{"$f":"SUM(Q407:Q420)","v":0},0,0,0,0,0,0,0,0,0,0,0,0,0,0,0,0,0,0,0,0,0,0,0,0,0,0,0,0,0]
["ÁREA DE ACCESO DE RECEPCION",null,null,null,null,null,null,null,null,null,null,null,null,null,null,null,null,null,null,null,null,null,null,null,null,null,null,null,null,null,null,null,null,null,null,null,null,null,null,null,null,null,null,null,null,null,{"$f":"SUM(O407:O415)","v":0},{"$f":"SUM(P407:P415)","v":0},{"$f":"SUM(Q407:Q415)","v":0},0,0,{"$f":"SUM(T407:T415)","v":0},0,0,{"$f":"SUM(W407:W415)","v":0},0,0,{"$f":"SUM(Z407:Z415)","v":0},0,0,{"$f":"SUM(AC407:AC415)","v":0},0,0,{"$f":"SUM(AF407:AF415)","v":0},0,0,{"$f":"SUM(AI407:AI415)","v":0},0,0,{"$f":"SUM(AL407:AL415)","v":0},0,0,{"$f":"SUM(AO407:AO415)","v":0},0,0,{"$f":"SUM(AR407:AR415)","v":0},0,0]
["Recepción - Admisión",{"$f":"B1","v":"Anx:"},{"$f":"C$1","v":"Cant x Espacio:"},"Requerido:","Tipo:","Funcional:","No Funcional:","Calif:","Observaciones:",{"$f":"Infraestructura!F168","v":0}]
["Mostrador",null,1,{"$f":"$J$408*C409","v":0},{"$f":"IF(D409>0, \"Requerido\", \"Sin Infraestructura\")","v":"Sin Infraestructura"},0,0,{"$f":"IF(AND(F409>=D409,F409>0,D409>0),10,0)","v":0},null,null,"MG",null,null,null,{"$f":"IF(UPPER(E409)=\"REQUERIDO\", 10, \"\")","v":""},{"$f":"IF(UPPER(E409)=\"REQUERIDO\", H409, \"\")","v":""}]
["Armario con cajones y estantes/Archivador",null,1,{"$f":"$J$408*C410","v":0},"Sin Infraestructura",0,0,0,null,null,"MG",null,null,null,"",""]
["Computador completo PC /Computador Portátil",null,1,{"$f":"$J$408*C411","v":0},"Sin Infraestructura",0,0,{"$f":"IF(AND(F411>=D411,F411>0,D411>0),10,0)","v":0},null,null,"EG",null,null,null,null,null,null,null,null,null,null,null,null,null,null,null,null,null,null,null,{"$f":"IF(UPPER(E411)=\"REQUERIDO\", 10, \"\")","v":""},{"$f":"IF(UPPER(E411)=\"REQUERIDO\", H411, \"\")","v":""}]
["Basurero con tapa y/o pedal",null,1,{"$f":"$J$408*C412","v":0},"Sin Infraestructura",0,0,0,null,null,"MG",null,null,null,{"$f":"IF(UPPER(E412)=\"REQUERIDO\", 10, \"\")","v":""},{"$f":"IF(UPPER(E412)=\"REQUERIDO\", H412, \"\")","v":""}]
["Silla",null,1,{"$f":"$J$408*C413","v":0},"Sin Infraestructura",0,0,0,null,null,"MG",null,null,null,"",""]
["Tablero de avisos ",null,1,{"$f":"$J$408*C414","v":0},"Sin Infraestructura",0,0,0,null,null,"MG",null,null,null,"",""]
["Teléfono",null,1,0,"Sin Infraestructura",0,0,0,null,null,"EG",null,null,null,null,null,null,null,null,null,null,null,null,null,null,null,null,null,null,null,{"$f":"IF(UPPER(E415)=\"REQUERIDO\", 10, \"\")","v":""},{"$f":"IF(UPPER(E415)=\"REQUERIDO\", H415, \"\")","v":""}]
["ÁREA DE ALMACENES",null,null,null,null,null,null,null,null,null,null,null,null,null,null,null,null,null,null,null,null,null,null,null,null,null,null,null,null,null,null,null,null,null,null,null,null,null,null,null,null,null,null,null,null,null,{"$f":"SUM(O417:O420)","v":30},{"$f":"SUM(P417:P420)","v":0},{"$f":"SUM(Q417:Q420)","v":0},0,0,0,0,0,0,0,0,0,0,0,0,0,0,0,0,0,0,0,0,0,0,0,0,0,0,0,0,0]
["Bodega General",{"$f":"B1","v":"Anx:"},{"$f":"C$1","v":"Cant x Espacio:"},"Requerido:","Tipo:","Funcional:","No Funcional:","Calif:","Observaciones:",{"$f":"Infraestructura!F174","v":0}]
["Escalera pata de gallo",null,1,{"$f":"$J$417*C418","v":0},"Requerido",0,0,{"$f":"IF(AND(F418>=D418,F418>0,D418>0),10,0)","v":0},null,null,"MG",null,null,null,{"$f":"IF(UPPER(E418)=\"REQUERIDO\", 10, \"\")","v":10},{"$f":"IF(UPPER(E418)=\"REQUERIDO\", H418, \"\")","v":0}]
["Extintor de incendios",null,1,{"$f":"$J$417*C419","v":0},"Requerido",0,0,0,null,null,"MG",null,null,null,10,0]
["Estanteria Básica",null,3,{"$f":"$J$417*C420","v":0},"Requerido",0,0,0,null,null,"MG",null,null,null,10,0,null,null,null,null,null,null,null,null,null,null,null,null,null,null,null,null,null,null,null,null,null,null,null,null,null,null,null,null,null,null,{"$f":"SUM(O422:O424)","v":10},{"$f":"SUM(P422:P424)","v":0},0,0,0,0,0,0,0,0,0,0,0,0,0,0,0,0,0,0,0,0,0,0,0,0,0,0,0,0,0,0]
["LIMPIEZA",null,null,null,null,null,null,null,null,null,null,null,null,null,null,null,null,null,null,null,null,null,null,null,null,null,null,null,null,null,null,null,null,null,null,null,null,null,null,null,null,null,null,null,null,null,{"$f":"SUM(O423:O424)","v":10},{"$f":"SUM(P423:P424)","v":0},0,0,0,0,0,0,0,0,0,0,0,0,0,0,0,0,0,0,0,0,0,0,0,0,0,0,0,0,0,0]
["ÁREA DE ALMACENES DE PRODUCTOS Y EQUIPOS DE LIMPIEZA",null,null,null,null,null,null,null,null,null,null,null,null,null,null,null,null,null,null,null,null,null,null,null,null,null,null,null,null,null,null,null,null,null,null,null,null,null,null,null,null,null,null,null,null,null,{"$f":"SUM(O423:O424)","v":10},{"$f":"SUM(P423:P424)","v":0},0,0,0,0,0,0,0,0,0,0,0,0,0,0,0,0,0,0,0,0,0,0,0,0,0,0,0,0,0,0]
["Bodega",{"$f":"B1","v":"Anx:"},{"$f":"C$1","v":"Cant x Espacio:"},"Requerido:","Tipo:","Funcional:","No Funcional:","Calif:","Observaciones:",{"$f":"Infraestructura!F181","v":0}]
["Estantería Básica",null,1,{"$f":"$J$423*C424","v":0},"Requerido",0,0,{"$f":"IF(AND(F424>=D424,F424>0,D424>0),10,0)","v":0},null,null,"MG",null,null,null,{"$f":"IF(UPPER(E424)=\"REQUERIDO\", 10, \"\")","v":10},{"$f":"IF(UPPER(E424)=\"REQUERIDO\", H424, \"\")","v":0},null,null,null,null,null,null,null,null,null,null,null,null,null,null,null,null,null,null,null,null,null,null,null,null,null,null,null,null,null,null,{"$f":"SUM(O426:O452)","v":240},{"$f":"SUM(P426:P452)","v":0},{"$f":"SUM(Q426:Q452)","v":0},{"$f":"SUM(R426:R452)","v":0},0,0,0,0,0,0,0,0,0,0,0,0,0,0,0,0,0,0,0,0,0,0,0,0,0,0,0,0]
["VESTUARIOS GENERAL",null,null,null,null,null,null,null,null,null,null,null,null,null,null,null,null,null,null,null,null,null,null,null,null,null,null,null,null,null,null,null,null,null,null,null,null,null,null,null,null,null,null,null,null,null,{"$f":"SUM(O427:O452)","v":240},{"$f":"SUM(P427:P452)","v":0},0,0,0,0,0,0,0,0,0,0,0,0,0,0,0,0,0,0,0,0,0,0,0,0,0,0,0,0,0,0]
["ÁREA DE PERSONAL",null,null,null,null,null,null,null,null,null,null,null,null,null,null,null,null,null,null,null,null,null,null,null,null,null,null,null,null,null,null,null,null,null,null,null,null,null,null,null,null,null,null,null,null,null,{"$f":"SUM(O428:O452)","v":240},{"$f":"SUM(P428:P452)","v":0},0,0,0,0,0,0,0,0,0,0,0,0,0,0,0,0,0,0,0,0,0,0,0,0,0,0,0,0,0,0]
["Vestidor general femenino con baño",{"$f":"B1","v":"Anx:"},"Cant x Espacio:","Requerido:","Tipo:","Funcional:","No Funcional:","Calif:","Observaciones:",{"$f":"Infraestructura!F189","v":0}]
["Lockers",null,5,{"$f":"$J$427*C428","v":0},"Requerido",0,0,0,null,null,"MG",null,null,null,{"$f":"IF(UPPER(E428)=\"REQUERIDO\", 10, \"\")","v":10},{"$f":"IF(UPPER(E428)=\"REQUERIDO\", H428, \"\")","v":0}]
["Banco de vestuario",null,1,{"$f":"$J$427*C429","v":0},"Requerido",0,0,{"$f":"IF(AND(F429>=D429,F429>0,D429>0),10,0)","v":0},null,null,"MG",null,null,null,10,0]
["Gancho doble",null,1,0,"Requerido",0,0,0,null,null,"MG",null,null,null,10,0]
["Basurero con tapa y/o pedal",null,1,0,"Requerido",0,0,0,null,null,"MG",null,null,null,10,0]
["Dosificador de jabón",null,1,0,"Requerido",0,0,0,null,null,"MG",null,null,null,10,0]
["Dispensador de papel toalla",null,1,0,"Requerido",0,0,0,null,null,"MG",null,null,null,10,0]
["Dispensador de papel higiénico",null,1,0,"Requerido",0,0,0,null,null,"MG",null,null,null,10,0]
["Espejo empotrado ",null,1,0,"Requerido",0,0,0,null,null,"MG",null,null,null,10,0]
["Gancho doble",null,1,0,"Requerido",0,0,0,null,null,"MG",null,null,null,10,0]
["Juego de ayudas técnicas",null,1,0,"Requerido",0,0,0,null,null,"MG",null,null,null,10,0]
["Lavabo ",null,1,0,"Requerido",0,0,0,null,null,"MG",null,null,null,10,0]
["Basurero con tapa y/o pedal",null,1,0,"Requerido",0,0,0,null,null,"MG",null,null,null,10,0]
["Vestidor general masculino con baño",{"$f":"B1","v":"Anx:"},{"$f":"C$1","v":"Cant x Espacio:"},"Requerido:","Tipo:","Funcional:","No Funcional:","Calif:","Observaciones:",{"$f":"Infraestructura!F190","v":0}]
["Lockers",null,5,{"$f":"$J$440*C441","v":0},"Requerido",0,0,{"$f":"IF(AND(F441>=D441,F441>0,D441>0),10,0)","v":0},null,null,"MG",null,null,null,{"$f":"IF(UPPER(E441)=\"REQUERIDO\", 10, \"\")","v":10},{"$f":"IF(UPPER(E441)=\"REQUERIDO\", H441, \"\")","v":0}]
["Banco de vestuario",null,1,{"$f":"$J$440*C442","v":0},"Requerido",0,0,0,null,null,"MG",null,null,null,10,0]
["Gancho doble",null,1,0,"Requerido",0,0,0,null,null,"MG",null,null,null,10,0]
["Basurero con tapa y/o pedal",null,1,0,"Requerido",0,0,0,null,null,"MG",null,null,null,10,0]
["Dosificador de jabón",null,1,0,"Requerido",0,0,0,null,null,"MG",null,null,null,10,0]
["Dispensador de papel toalla",null,1,0,"Requerido",0,0,0,null,null,"MG",null,null,null,10,0]
["Dispensador de papel higiénico",null,1,0,"Requerido",0,0,0,null,null,"MG",null,null,null,10,0]
["Espejo empotrado ",null,1,0,"Requerido",0,0,0,null,null,"MG",null,null,null,10,0]
["Gancho doble",null,1,0,"Requerido",0,0,0,null,null,"MG",null,null,null,10,0]
["Juego de ayudas técnicas",null,1,0,"Requerido",0,0,0,null,null,"MG",null,null,null,10,0]
["Lavabo ",null,1,0,"Requerido",0,0,0,null,null,"MG",null,null,null,10,0]
["Basurero con tapa y/o pedal",null,1,0,"Requerido",0,0,0,null,null,"MG",null,null,null,10,0,null,null,null,null,null,null,null,null,null,null,null,null,null,null,null,null,null,null,null,null,null,null,null,null,null,null,null,null,null,null,{"$f":"SUM(O454:O460)","v":0},{"$f":"SUM(P454:P460)","v":0},0,0,0,0,0,0,0,0,0,0,0,0,0,0,0,0,0,0,0,0,0,0,0,0,0,0,0,0,0,0]
["MANTENIMIENTO",null,null,null,null,null,null,null,null,null,null,null,null,null,null,null,null,null,null,null,null,null,null,null,null,null,null,null,null,null,null,null,null,null,null,null,null,null,null,null,null,null,null,null,null,null,{"$f":"SUM(O454:O460)","v":0},{"$f":"SUM(P454:P460)","v":0},{"$f":"SUM(Q454:Q460)","v":0},{"$f":"SUM(R454:R460)","v":0},0,0,0,0,0,0,0,0,0,0,0,0,0,0,0,0,0,0,0,0,0,0,0,0,0,0,0,0]
["ÁREA TÉCNICA",null,null,null,null,null,null,null,null,null,null,null,null,null,null,null,null,null,null,null,null,null,null,null,null,null,null,null,null,null,null,null,null,null,null,null,null,null,null,null,null,null,null,null,null,null,{"$f":"SUM(O456:O460)","v":0},{"$f":"SUM(P456:P460)","v":0},0,0,0,0,0,0,0,0,0,0,0,0,0,0,0,0,0,0,0,0,0,0,0,0,0,0,0,0,0,0]
["Taller",{"$f":"B1","v":"Anx:"},{"$f":"C$1","v":"Cant x Espacio:"},"Requerido:","Tipo:","Funcional:","No Funcional:","Calif:","Observaciones:",{"$f":"Infraestructura!F197","v":0}]
["Mesa de trabajo",null,1,{"$f":"$J$455*C456","v":0},{"$f":"IF(D456>0, \"Requerido\", \"Sin Infraestructura\")","v":"Sin Infraestructura"},0,0,{"$f":"IF(AND(F456>=D456,F456>0,D456>0),10,0)","v":0},null,null,"MG",null,null,null,{"$f":"IF(UPPER(E456)=\"REQUERIDO\", 10, \"\")","v":""},{"$f":"IF(UPPER(E456)=\"REQUERIDO\", H456, \"\")","v":""}]
["Estantería básica",null,1,{"$f":"$J$455*C457","v":0},"Sin Infraestructura",0,0,0,null,null,"MG",null,null,null,"",""]
["Silla",null,1,{"$f":"$J$455*C458","v":0},"Sin Infraestructura",0,0,0,null,null,"MG",null,null,null,"",""]
["Computador completo PC /Computador Portátil",null,1,{"$f":"$J$455*C459","v":0},"Sin Infraestructura",0,0,0,null,null,"EG",null,null,null,null,null,null,null,null,null,null,null,null,null,null,null,null,null,null,null,{"$f":"IF(UPPER(E459)=\"REQUERIDO\", 10, \"\")","v":""},{"$f":"IF(UPPER(E459)=\"REQUERIDO\", H459, \"\")","v":""}]
["Basurero con tapa y/o pedal",null,1,{"$f":"$J$455*C460","v":0},"Sin Infraestructura",0,0,0,null,null,"MG",null,null,null,{"$f":"IF(UPPER(E460)=\"REQUERIDO\", 10, \"\")","v":""},{"$f":"IF(UPPER(E460)=\"REQUERIDO\", H460, \"\")","v":""},null,null,null,null,null,null,null,null,null,null,null,null,null,null,null,null,null,null,null,null,null,null,null,null,null,null,null,null,null,null,{"$f":"SUM(O462:O468)","v":0},{"$f":"SUM(P462:P468)","v":0},0,0,0,0,0,0,0,0,0,0,0,0,0,0,0,0,0,0,0,0,0,0,0,0,0,0,0,0,0,0]
["ALMACENAMIENTO FINAL DE DESECHOS",null,null,null,null,null,null,null,null,null,null,null,null,null,null,null,null,null,null,null,null,null,null,null,null,null,null,null,null,null,null,null,null,null,null,null,null,null,null,null,null,null,null,null,null,null,{"$f":"SUM(O462:O468)","v":0},{"$f":"SUM(P462:P468)","v":0},0,0,0,0,0,0,0,0,0,0,0,0,0,0,0,0,0,0,0,0,0,0,0,0,0,0,0,0,0,0]
["ÁREA TÉCNICA",null,null,null,null,null,null,null,null,null,null,null,null,null,null,null,null,null,null,null,null,null,null,null,null,null,null,null,null,null,null,null,null,null,null,null,null,null,null,null,null,null,null,null,null,null,{"$f":"SUM(O464:O468)","v":0},{"$f":"SUM(P464:P468)","v":0},0,0,0,0,0,0,0,0,0,0,0,0,0,0,0,0,0,0,0,0,0,0,0,0,0,0,0,0,0,0]
["Área de residuos generales-comunes",{"$f":"B1","v":"Anx:"},{"$f":"C$1","v":"Cant x Espacio:"},"Requerido:","Tipo:","Funcional:","No Funcional:","Calif:","Observaciones:",{"$f":"Infraestructura!F204","v":0}]
["Contenedor ",null,1,{"$f":"$J$463*C464","v":0},{"$f":"IF(D464>0, \"Requerido\", \"Sin Infraestructura\")","v":"Sin Infraestructura"},0,0,{"$f":"IF(AND(F464>=D464,F464>0,D464>0),10,0)","v":0},null,null,"MG",null,null,null,{"$f":"IF(UPPER(E464)=\"REQUERIDO\", 10, \"\")","v":""},{"$f":"IF(UPPER(E464)=\"REQUERIDO\", H464, \"\")","v":""}]
["Área de residuos peligrosos-infecciosos",{"$f":"B1","v":"Anx:"},{"$f":"C$1","v":"Cant x Espacio:"},"Requerido:","Tipo:","Funcional:","No Funcional:","Calif:","Observaciones:",{"$f":"Infraestructura!F205","v":0}]
["Contenedor ",null,1,{"$f":"$J$465*C466","v":0},{"$f":"IF(D466>0, \"Requerido\", \"Sin Infraestructura\")","v":"Sin Infraestructura"},0,0,{"$f":"IF(AND(F466>=D466,F466>0,D466>0),10,0)","v":0},null,null,"MG",null,null,null,{"$f":"IF(UPPER(E466)=\"REQUERIDO\", 10, \"\")","v":""},{"$f":"IF(UPPER(E466)=\"REQUERIDO\", H466, \"\")","v":""}]
["Área de residuos especiales",{"$f":"B1","v":"Anx:"},"Cant x Espacio:","Requerido:","Tipo:","Funcional:","No Funcional:","Calif:","Observaciones:",{"$f":"Infraestructura!F206","v":0}]
["Contenedor ",null,1,{"$f":"$J$467*C468","v":0},{"$f":"IF(D468>0, \"Requerido\", \"Sin Infraestructura\")","v":"Sin Infraestructura"},0,0,{"$f":"IF(AND(F468>=D468,F468>0,D468>0),10,0)","v":0},null,null,"MG",null,null,null,{"$f":"IF(UPPER(E468)=\"REQUERIDO\", 10, \"\")","v":""},{"$f":"IF(UPPER(E468)=\"REQUERIDO\", H468, \"\")","v":""}]
["TOTALES PARCIALES:",null,null,null,null,null,null,null,null,null,null,null,null,null,null,null,null,null,null,null,null,null,null,null,null,null,null,null,null,null,null,null,null,null,null,null,null,null,"TOTAL GENERAL:",null,null,null,null,null,null,null,{"$f":"(+Equipamiento!$AU$4+Equipamiento!$AU$99+Equipamiento!$AU$160+Equipamiento!$AU$192+Equipamiento!$AU$232+Equipamiento!$AU$328+AU405)","v":1330},{"$f":"(+Equipamiento!$AV$4+Equipamiento!$AV$99+AU160+Equipamiento!$AV$192+Equipamiento!$AV$232+Equipamiento!$AV$328+Equipamiento!$AV$405)","v":80},{"$f":"(+Equipamiento!$AW$4+Equipamiento!$AW$99+Equipamiento!$AW$160+Equipamiento!$AW$192+AW232+Equipamiento!$AW$328+Equipamiento!$AW$405)","v":20},{"$f":"(AX4+AX99+AX160+AX192+AX232+AX328+AX405)","v":0},{"$f":"(AY4+AY99+AY160+AY192+AY232+AY328+AY405)","v":80},{"$f":"(AZ4+AZ99+AZ160+AZ192+AZ232+AZ328+AZ405)","v":0},{"$f":"(BA4+BA99+BA160+BA192+BA232+BA328+BA405)","v":0},{"$f":"(BB4+BB99+BB160+BB192+BB232+BB328+BB405)","v":0},60,0,20,0,0,0,0,0,120,0,50,0,{"$f":"(BO4+BO99+BO160+BO192+BO232+BO328+BO405)","v":0},0,0,0,140,0,0,0,0,0,10,0]
["MOBILIARIO GENERAL:",null,"% Obtenido:","% Obtenido:","% Obtenido:","% A Cumplir:","% Final:",null,null,null,null,null,null,null,null,null,null,null,null,null,null,null,null,null,null,null,null,null,null,null,null,null,null,null,null,null,null,null,"SERVICIO DE ADMISIÓN Y CONSULTA EXTERNA",null,null,null,"SERVICIO DE ADMISIÓN Y CONSULTA EXTERNA",null,null,null,{"$f":"AU4*100/AU469","v":32.330827067669176},{"$f":"AV4*100/AU469","v":0},{"$f":"AW4*100/AW469","v":50},{"$f":"AX4*100/AW469","v":0},{"$f":"AY4*100/AY469","v":0},{"$f":"AZ4*100/AY469","v":0},{"$f":"BA4*100/BA469","v":{"$error":"#DIV/0!"}},{"$f":"BB4*100/BA469","v":{"$error":"#DIV/0!"}},{"$f":"BC4*100/BC469","v":16.666666666666668},{"$f":"BD4*100/BC469","v":0},{"$f":"BE4*100/BE469","v":0},{"$f":"BF4*100/BE469","v":0},{"$f":"BG4*100/BG469","v":{"$error":"#DIV/0!"}},{"$f":"BH4*100/BG469","v":{"$error":"#DIV/0!"}},{"$f":"BI4*100/BI469","v":{"$error":"#DIV/0!"}},{"$f":"BJ4*100/BI469","v":{"$error":"#DIV/0!"}},{"$f":"BK4*100/BK469","v":50},{"$f":"BL4*100/BK469","v":0},{"$f":"BM4*100/BM469","v":0},{"$f":"BN4*100/BM469","v":0},{"$f":"BO4*100/BO469","v":{"$error":"#DIV/0!"}},{"$f":"BP4*100/BO469","v":{"$error":"#DIV/0!"}},{"$f":"BQ4*100/BQ469","v":{"$error":"#DIV/0!"}},{"$f":"BR4*100/BQ469","v":{"$error":"#DIV/0!"}},{"$f":"BS4*100/BS469","v":71.428571428571431},{"$f":"BT4*100/BS469","v":0},{"$f":"BU4*100/BU469","v":{"$error":"#DIV/0!"}},{"$f":"BV4*100/BU469","v":{"$error":"#DIV/0!"}},{"$f":"BW4*100/BW469","v":{"$error":"#DIV/0!"}},{"$f":"BX4*100/BW469","v":{"$error":"#DIV/0!"}},{"$f":"BY4*100/BY469","v":0},{"$f":"BZ4*100/BY469","v":0}]
[{"$f":"Equipamiento!$AM$470","v":"SERVICIO DE ADMISIÓN Y CONSULTA EXTERNA"},null,{"$f":"Equipamiento!$AV$470*25/100/100","v":0},null,null,{"$f":"Equipamiento!$AU$470*25/100/100","v":8.0827067669172942E-2},{"$f":"IF(Equipamiento!$C$471=Equipamiento!$F$471, \"CUMPLE\", \"NO CUMPLE\")","v":"NO CUMPLE"},null,null,null,null,null,null,null,null,null,null,null,null,null,null,null,null,null,null,null,null,null,null,null,null,null,null,null,null,null,null,null,"CONSULTA EXTERNA",null,null,null,"CONSULTA EXTERNA",null,null,null,{"$f":"AU5*100/AU469","v":32.330827067669176},{"$f":"AV5*100/AU469","v":0},{"$f":"AW5*100/AW469","v":50},{"$f":"AX5*100/AW469","v":0},{"$f":"AY5*100/AY469","v":0},{"$f":"AZ5*100/AY469","v":0},{"$f":"BA5*100/BA469","v":{"$error":"#DIV/0!"}},{"$f":"BB5*100/BA469","v":{"$error":"#DIV/0!"}},{"$f":"BC5*100/BC469","v":16.666666666666668},{"$f":"BD5*100/BC469","v":0},{"$f":"BE5*100/BE469","v":0},{"$f":"BF5*100/BE469","v":0},{"$f":"BG5*100/BG469","v":{"$error":"#DIV/0!"}},{"$f":"BH5*100/BG469","v":{"$error":"#DIV/0!"}},{"$f":"BI5*100/BI469","v":{"$error":"#DIV/0!"}},{"$f":"BJ5*100/BI469","v":{"$error":"#DIV/0!"}},{"$f":"BK5*100/BK469","v":50},{"$f":"BL5*100/BK469","v":0},{"$f":"BM5*100/BM469","v":0},{"$f":"BN5*100/BM469","v":0},{"$f":"BO5*100/BO469","v":{"$error":"#DIV/0!"}},{"$f":"BP5*100/BO469","v":{"$error":"#DIV/0!"}},{"$f":"BQ5*100/BQ469","v":{"$error":"#DIV/0!"}},{"$f":"BR5*100/BQ469","v":{"$error":"#DIV/0!"}},{"$f":"BS5*100/BS469","v":71.428571428571431},{"$f":"BT5*100/BS469","v":0},{"$f":"BU5*100/BU469","v":{"$error":"#DIV/0!"}},{"$f":"BV5*100/BU469","v":{"$error":"#DIV/0!"}},{"$f":"BW5*100/BW469","v":{"$error":"#DIV/0!"}},{"$f":"BX5*100/BW469","v":{"$error":"#DIV/0!"}},{"$f":"BY5*100/BY469","v":0},{"$f":"BZ5*100/BY469","v":0}]
[{"$f":"Equipamiento!$AM$471","v":"CONSULTA EXTERNA"},null,null,{"$f":"Equipamiento!$AV$471*25/100/100","v":0},null,{"$f":"Equipamiento!$AU$471*25/100/100","v":8.0827067669172942E-2},{"$f":"IF(Equipamiento!$D$472=Equipamiento!$F$472, \"CUMPLE\", \"NO CUMPLE\")","v":"NO CUMPLE"},null,null,null,null,null,null,null,null,null,null,null,null,null,null,null,null,null,null,null,null,null,null,null,null,null,null,null,null,null,null,null,"ADMISIÓN Y CONTROL",null,null,null,"ADMISIÓN Y CONTROL",null,null,null,{"$f":"AU6*100/AU469","v":12.030075187969924},{"$f":"AV6*100/AU469","v":0},{"$f":"AW6*100/AW469","v":0},{"$f":"AX6*100/AW469","v":0},{"$f":"AY6*100/AY469","v":0},{"$f":"AZ6*100/AY469","v":0},{"$f":"BA6*100/BA469","v":{"$error":"#DIV/0!"}},{"$f":"BB6*100/BA469","v":{"$error":"#DIV/0!"}},{"$f":"BC6*100/BC469","v":0},{"$f":"BD6*100/BC469","v":0},{"$f":"BE6*100/BE469","v":0},{"$f":"BF6*100/BE469","v":0},{"$f":"BG6*100/BG469","v":{"$error":"#DIV/0!"}},{"$f":"BH6*100/BG469","v":{"$error":"#DIV/0!"}},{"$f":"BI6*100/BI469","v":{"$error":"#DIV/0!"}},{"$f":"BJ6*100/BI469","v":{"$error":"#DIV/0!"}},{"$f":"BK6*100/BK469","v":25},{"$f":"BL6*100/BK469","v":0},{"$f":"BM6*100/BM469","v":0},{"$f":"BN6*100/BM469","v":0},{"$f":"BO6*100/BO469","v":{"$error":"#DIV/0!"}},{"$f":"BP6*100/BO469","v":{"$error":"#DIV/0!"}},{"$f":"BQ6*100/BQ469","v":{"$error":"#DIV/0!"}},{"$f":"BR6*100/BQ469","v":{"$error":"#DIV/0!"}},{"$f":"BS6*100/BS469","v":0},{"$f":"BT6*100/BS469","v":0},{"$f":"BU6*100/BU469","v":{"$error":"#DIV/0!"}},{"$f":"BV6*100/BU469","v":{"$error":"#DIV/0!"}},{"$f":"BW6*100/BW469","v":{"$error":"#DIV/0!"}},{"$f":"BX6*100/BW469","v":{"$error":"#DIV/0!"}},{"$f":"BY6*100/BY469","v":0},{"$f":"BZ6*100/BY469","v":0}]
[{"$f":"Equipamiento!$AM$472","v":"ADMISIÓN Y CONTROL"},null,null,null,{"$f":"Equipamiento!$AV$472*25/100/100","v":0},{"$f":"Equipamiento!$AU$472*25/100/100","v":3.007518796992481E-2},{"$f":"IF(Equipamiento!$E$473=Equipamiento!$F$473, \"CUMPLE\", \"NO CUMPLE\")","v":"NO CUMPLE"},null,null,null,null,null,null,null,null,null,null,null,null,null,null,null,null,null,null,null,null,null,null,null,null,null,null,null,null,null,null,null,"AREA DE PACIENTE",null,null,null,"AREA DE PACIENTE",null,null,null,{"$f":"AU30*100/AU469","v":20.300751879699249},{"$f":"AV30*100/AU469","v":0},{"$f":"AW30*100/AW469","v":50},{"$f":"AX30*100/AW469","v":0},{"$f":"AY30*100/AY469","v":0},{"$f":"AZ30*100/AY469","v":0},{"$f":"BA30*100/BA469","v":{"$error":"#DIV/0!"}},{"$f":"BB30*100/BA469","v":{"$error":"#DIV/0!"}},{"$f":"BC30*100/BC469","v":16.666666666666668},{"$f":"BD30*100/BC469","v":0},{"$f":"BE30*100/BE469","v":0},{"$f":"BF30*100/BE469","v":0},{"$f":"BG30*100/BG469","v":{"$error":"#DIV/0!"}},{"$f":"BH30*100/BG469","v":{"$error":"#DIV/0!"}},{"$f":"BI30*100/BI469","v":{"$error":"#DIV/0!"}},{"$f":"BJ30*100/BI469","v":{"$error":"#DIV/0!"}},{"$f":"BK30*100/BK469","v":25},{"$f":"BL30*100/BK469","v":0},{"$f":"BM30*100/BM469","v":0},{"$f":"BN30*100/BM469","v":0},{"$f":"BO30*100/BO469","v":{"$error":"#DIV/0!"}},{"$f":"BP30*100/BO469","v":{"$error":"#DIV/0!"}},{"$f":"BQ30*100/BQ469","v":{"$error":"#DIV/0!"}},{"$f":"BR30*100/BQ469","v":{"$error":"#DIV/0!"}},{"$f":"BS30*100/BS469","v":71.428571428571431},{"$f":"BT30*100/BS469","v":0},{"$f":"BU30*100/BU469","v":{"$error":"#DIV/0!"}},{"$f":"BV30*100/BU469","v":{"$error":"#DIV/0!"}},{"$f":"BW30*100/BW469","v":{"$error":"#DIV/0!"}},{"$f":"BX30*100/BW469","v":{"$error":"#DIV/0!"}},{"$f":"BY30*100/BY469","v":0},{"$f":"BZ30*100/BY469","v":0}]
[{"$f":"Equipamiento!$AM$473","v":"AREA DE PACIENTE"},null,null,null,{"$f":"Equipamiento!$AV$473*25/100/100","v":0},{"$f":"Equipamiento!$AU$473*25/100/100","v":5.0751879699248124E-2},{"$f":"IF(Equipamiento!$E$474=Equipamiento!$F$474, \"CUMPLE\", \"NO CUMPLE\")","v":"NO CUMPLE"},null,null,null,null,null,null,null,null,null,null,null,null,null,null,null,null,null,null,null,null,null,null,null,null,null,null,null,null,null,null,null,"SERVICIO DE DIÁLISIS PERITONEAL",null,null,null,"SERVICIO DE HEMODIÁLISIS",null,null,null,{"$f":"AU99*100/AU469","v":10.526315789473685},{"$f":"AV99*100/AU469","v":0},{"$f":"AW99*100/AW469","v":50},{"$f":"AX99*100/AW469","v":0},{"$f":"AY99*100/AY469","v":12.5},{"$f":"AZ99*100/AY469","v":0},{"$f":"BA99*100/BA469","v":{"$error":"#DIV/0!"}},{"$f":"BB99*100/BA469","v":{"$error":"#DIV/0!"}},{"$f":"BC99*100/BC469","v":0},{"$f":"BD99*100/BC469","v":0},{"$f":"BE99*100/BE469","v":0},{"$f":"BF99*100/BE469","v":0},{"$f":"BG99*100/BG469","v":{"$error":"#DIV/0!"}},{"$f":"BH99*100/BG469","v":{"$error":"#DIV/0!"}},{"$f":"BI99*100/BI469","v":{"$error":"#DIV/0!"}},{"$f":"BJ99*100/BI469","v":{"$error":"#DIV/0!"}},{"$f":"BK99*100/BK469","v":8.3333333333333339},{"$f":"BL99*100/BK469","v":0},{"$f":"BM99*100/BM469","v":20},{"$f":"BN99*100/BM469","v":0},{"$f":"BO99*100/BO469","v":{"$error":"#DIV/0!"}},{"$f":"BP99*100/BO469","v":{"$error":"#DIV/0!"}},{"$f":"BQ99*100/BQ469","v":{"$error":"#DIV/0!"}},{"$f":"BR99*100/BQ469","v":{"$error":"#DIV/0!"}},{"$f":"BS99*100/BS469","v":0},{"$f":"BT99*100/BS469","v":0},{"$f":"BU99*100/BU469","v":{"$error":"#DIV/0!"}},{"$f":"BV99*100/BU469","v":{"$error":"#DIV/0!"}},{"$f":"BW99*100/BW469","v":{"$error":"#DIV/0!"}},{"$f":"BX99*100/BW469","v":{"$error":"#DIV/0!"}},{"$f":"BY99*100/BY469","v":0},{"$f":"BZ99*100/BY469","v":0}]
[{"$f":"Infraestructura!$W$237","v":"SERVICIO DE DIÁLISIS PERITONEAL"},null,{"$f":"Equipamiento!$AV$474*25/100/100","v":0},null,null,{"$f":"Equipamiento!$AU$474*25/100/100","v":2.6315789473684213E-2},{"$f":"IF(Equipamiento!$C$475=Equipamiento!$F$475, \"CUMPLE\", \"NO CUMPLE\")","v":"NO CUMPLE"},null,null,null,null,null,null,null,null,null,null,null,null,null,null,null,null,null,null,null,null,null,null,null,null,null,null,null,null,null,null,null,"ÁREA DE PROCEDIMIENTO  DE DIÁLISIS PERITONEAL",null,null,null,"ÁREA DE PROCEDIMIENTO  DE HEMODIÁLISIS",null,null,null,{"$f":"AU100*100/AU469","v":0},{"$f":"AV100*100/AU469","v":0},{"$f":"AW100*100/AW469","v":0},{"$f":"AX100*100/AW469","v":0},{"$f":"AY100*100/AY469","v":12.5},{"$f":"AZ100*100/AY469","v":0},{"$f":"BA100*100/BA469","v":{"$error":"#DIV/0!"}},{"$f":"BB100*100/BA469","v":{"$error":"#DIV/0!"}},{"$f":"BC100*100/BC469","v":0},{"$f":"BD100*100/BC469","v":0},{"$f":"BE100*100/BE469","v":0},{"$f":"BF100*100/BE469","v":0},{"$f":"BG100*100/BG469","v":{"$error":"#DIV/0!"}},{"$f":"BH100*100/BG469","v":{"$error":"#DIV/0!"}},{"$f":"BI100*100/BI469","v":{"$error":"#DIV/0!"}},{"$f":"BJ100*100/BI469","v":{"$error":"#DIV/0!"}},{"$f":"BK100*100/BK469","v":0},{"$f":"BL100*100/BK469","v":0},{"$f":"BM100*100/BM469","v":0},{"$f":"BN100*100/BM469","v":0},{"$f":"BO100*100/BO469","v":{"$error":"#DIV/0!"}},{"$f":"BP100*100/BO469","v":{"$error":"#DIV/0!"}},{"$f":"BQ100*100/BQ469","v":{"$error":"#DIV/0!"}},{"$f":"BR100*100/BQ469","v":{"$error":"#DIV/0!"}},{"$f":"BS100*100/BS469","v":0},{"$f":"BT100*100/BS469","v":0},{"$f":"BU100*100/BU469","v":{"$error":"#DIV/0!"}},{"$f":"BV100*100/BU469","v":{"$error":"#DIV/0!"}},{"$f":"BW100*100/BW469","v":{"$error":"#DIV/0!"}},{"$f":"BX100*100/BW469","v":{"$error":"#DIV/0!"}},{"$f":"BY100*100/BY469","v":0},{"$f":"BZ100*100/BY469","v":0}]
[{"$f":"Infraestructura!$W$238","v":"ÁREA DE PROCEDIMIENTO  DE DIÁLISIS PERITONEAL"},null,null,{"$f":"Equipamiento!$AV$475*25/100/100","v":0},null,{"$f":"Equipamiento!$AU$475*25/100/100","v":0},{"$f":"IF(Equipamiento!$D$476=Equipamiento!$F$476, \"CUMPLE\", \"NO CUMPLE\")","v":"CUMPLE"},null,null,null,null,null,null,null,null,null,null,null,null,null,null,null,null,null,null,null,null,null,null,null,null,null,null,null,null,null,null,null,"ÁREA DE TRATAMIENTO",null,null,null,"ÁREA DE TRATAMIENTO",null,null,null,{"$f":"AU101*100/AU469","v":0},{"$f":"AV101*100/AU469","v":0},{"$f":"AW101*100/AW469","v":0},{"$f":"AX475","v":0},{"$f":"AY101*100/AY469","v":12.5},{"$f":"AZ101*100/AY469","v":0},{"$f":"BA101*100/BA469","v":{"$error":"#DIV/0!"}},{"$f":"BB101*100/BA469","v":{"$error":"#DIV/0!"}},{"$f":"BC101*100/BC469","v":0},{"$f":"BD475","v":0},{"$f":"BE101*100/BE469","v":0},{"$f":"BF475","v":0},{"$f":"BG101*100/BG469","v":{"$error":"#DIV/0!"}},{"$f":"BH475","v":{"$error":"#DIV/0!"}},{"$f":"BI101*100/BI469","v":{"$error":"#DIV/0!"}},{"$f":"BJ475","v":{"$error":"#DIV/0!"}},{"$f":"BK101*100/BK469","v":0},{"$f":"BL475","v":0},{"$f":"BM101*100/BM469","v":0},{"$f":"BN101*100/BM469","v":0},{"$f":"BO101*100/BO469","v":{"$error":"#DIV/0!"}},{"$f":"BP475","v":{"$error":"#DIV/0!"}},{"$f":"BQ101*100/BQ469","v":{"$error":"#DIV/0!"}},{"$f":"BR475","v":{"$error":"#DIV/0!"}},{"$f":"BS101*100/BS469","v":0},{"$f":"BT101*100/BS469","v":0},{"$f":"BU101*100/BU469","v":{"$error":"#DIV/0!"}},{"$f":"BV475","v":{"$error":"#DIV/0!"}},{"$f":"BW101*100/BW469","v":{"$error":"#DIV/0!"}},{"$f":"BX475","v":{"$error":"#DIV/0!"}},{"$f":"BY101*100/BY469","v":0},{"$f":"BZ475","v":0}]
[{"$f":"AM476","v":"ÁREA DE TRATAMIENTO"},null,null,null,{"$f":"Equipamiento!$AV$476*25/100/100","v":0},{"$f":"Equipamiento!$AU$476*25/100/100","v":0},{"$f":"IF(Equipamiento!$E$477=Equipamiento!$F$477, \"CUMPLE\", \"NO CUMPLE\")","v":"CUMPLE"},null,null,null,null,null,null,null,null,null,null,null,null,null,null,null,null,null,null,null,null,null,null,null,null,null,null,null,null,null,null,null,"ÁREA DE APOYO Y APROVISONAMIENTO",null,null,null,"ÁREA DE APOYO Y APROVISONAMIENTO",null,null,null,{"$f":"AU132*100/AU469","v":10.526315789473685},{"$f":"AV132*100/AU469","v":0},{"$f":"AW132*100/AW469","v":50},{"$f":"AX132*100/AW469","v":0},{"$f":"AY132*100/AY469","v":0},{"$f":"AZ132*100/AY469","v":0},{"$f":"BA132*100/BA469","v":{"$error":"#DIV/0!"}},{"$f":"BB132*100/BA469","v":{"$error":"#DIV/0!"}},{"$f":"BC132*100/BC469","v":0},{"$f":"BD132*100/BC469","v":0},{"$f":"BE132*100/BE469","v":0},{"$f":"BF132*100/BE469","v":0},{"$f":"BG132*100/BG469","v":{"$error":"#DIV/0!"}},{"$f":"BH132*100/BG469","v":{"$error":"#DIV/0!"}},{"$f":"BI132*100/BI469","v":{"$error":"#DIV/0!"}},{"$f":"BJ132*100/BI469","v":{"$error":"#DIV/0!"}},{"$f":"BK132*100/BK469","v":8.3333333333333339},{"$f":"BL132*100/BK469","v":0},{"$f":"BM132*100/BM469","v":20},{"$f":"BN132*100/BM469","v":0},{"$f":"BO132*100/BO469","v":{"$error":"#DIV/0!"}},{"$f":"BP132*100/BO469","v":{"$error":"#DIV/0!"}},{"$f":"BQ132*100/BQ469","v":{"$error":"#DIV/0!"}},{"$f":"BR132*100/BQ469","v":{"$error":"#DIV/0!"}},{"$f":"BS132*100/BS469","v":0},{"$f":"BT132*100/BS469","v":0},{"$f":"BU132*100/BU469","v":{"$error":"#DIV/0!"}},{"$f":"BV132*100/BU469","v":{"$error":"#DIV/0!"}},{"$f":"BW132*100/BW469","v":{"$error":"#DIV/0!"}},{"$f":"BX132*100/BW469","v":{"$error":"#DIV/0!"}},{"$f":"BY132*100/BY469","v":0},{"$f":"BZ132*100/BY469","v":0}]
[{"$f":"Equipamiento!$AM$477","v":"ÁREA DE APOYO Y APROVISONAMIENTO"},null,null,{"$f":"Equipamiento!$AV$477*25/100/100","v":0},null,{"$f":"Equipamiento!$AU$477*25/100/100","v":2.6315789473684213E-2},{"$f":"IF(Equipamiento!$D$478=Equipamiento!$F$478, \"CUMPLE\", \"NO CUMPLE\")","v":"NO CUMPLE"},null,null,null,null,null,null,null,null,null,null,null,null,null,null,null,null,null,null,null,null,null,null,null,null,null,null,null,null,null,null,null,"ÁREA PACIENTE",null,null,null,"ÁREA PACIENTE",null,null,null,{"$f":"AU133*100/AU469","v":3.7593984962406015},{"$f":"AV133*100/AU469","v":0},{"$f":"AW133*100/AW469","v":0},{"$f":"AX133*100/AW469","v":0},{"$f":"AY133*100/AY469","v":0},{"$f":"AZ133*100/AY469","v":0},{"$f":"BA133*100/BA469","v":{"$error":"#DIV/0!"}},{"$f":"BB133*100/BA469","v":{"$error":"#DIV/0!"}},{"$f":"BC133*100/BC469","v":0},{"$f":"BD133*100/BC469","v":0},{"$f":"BE133*100/BE469","v":0},{"$f":"BF133*100/BE469","v":0},{"$f":"BG133*100/BG469","v":{"$error":"#DIV/0!"}},{"$f":"BH133*100/BG469","v":{"$error":"#DIV/0!"}},{"$f":"BI133*100/BI469","v":{"$error":"#DIV/0!"}},{"$f":"BJ133*100/BI469","v":{"$error":"#DIV/0!"}},{"$f":"BK133*100/BK469","v":8.3333333333333339},{"$f":"BL133*100/BK469","v":0},{"$f":"BM133*100/BM469","v":0},{"$f":"BN133*100/BM469","v":0},{"$f":"BO133*100/BO469","v":{"$error":"#DIV/0!"}},{"$f":"BP133*100/BO469","v":{"$error":"#DIV/0!"}},{"$f":"BQ133*100/BQ469","v":{"$error":"#DIV/0!"}},{"$f":"BR133*100/BQ469","v":{"$error":"#DIV/0!"}},{"$f":"BS133*100/BS469","v":0},{"$f":"BT133*100/BS469","v":0},{"$f":"BU133*100/BU469","v":{"$error":"#DIV/0!"}},{"$f":"BV133*100/BU469","v":{"$error":"#DIV/0!"}},{"$f":"BW133*100/BW469","v":{"$error":"#DIV/0!"}},{"$f":"BX133*100/BW469","v":{"$error":"#DIV/0!"}},{"$f":"BY133*100/BY469","v":0},{"$f":"BZ133*100/BY469","v":0}]
[{"$f":"Equipamiento!$AM$478","v":"ÁREA PACIENTE"},null,null,null,{"$f":"Equipamiento!$AV$478*25/100/100","v":0},{"$f":"Equipamiento!$AU$478*25/100/100","v":9.3984962406015032E-3},{"$f":"IF(Equipamiento!$E$479=Equipamiento!$F$479, \"CUMPLE\", \"NO CUMPLE\")","v":"NO CUMPLE"},null,null,null,null,null,null,null,null,null,null,null,null,null,null,null,null,null,null,null,null,null,null,null,null,null,null,null,null,null,null,null,"SERVICIO DE DIÁLISIS PERITONEAL",null,null,null,"SERVICIO DE DIÁLISIS PERITONEAL",null,null,null,{"$f":"AU160*100/AU469","v":6.0150375939849621},{"$f":"AV160*100/AU469","v":0},{"$f":"AW160*100/AW469","v":0},{"$f":"AX160*100/AW469","v":0},{"$f":"AY160*100/AY469","v":0},{"$f":"AZ160*100/AY469","v":0},{"$f":"BA160*100/BA469","v":{"$error":"#DIV/0!"}},{"$f":"BB160*100/BA469","v":{"$error":"#DIV/0!"}},{"$f":"BC160*100/BC469","v":33.333333333333336},{"$f":"BD160*100/BC469","v":0},{"$f":"BE160*100/BE469","v":100},{"$f":"BF160*100/BE469","v":0},{"$f":"BG160*100/BG469","v":{"$error":"#DIV/0!"}},{"$f":"BH160*100/BG469","v":{"$error":"#DIV/0!"}},{"$f":"BI160*100/BI469","v":{"$error":"#DIV/0!"}},{"$f":"BJ160*100/BI469","v":{"$error":"#DIV/0!"}},{"$f":"BK160*100/BK469","v":8.3333333333333339},{"$f":"BL160*100/BK469","v":0},{"$f":"BM160*100/BM469","v":0},{"$f":"BN160*100/BM469","v":0},{"$f":"BO160*100/BO469","v":{"$error":"#DIV/0!"}},{"$f":"BP160*100/BO469","v":{"$error":"#DIV/0!"}},{"$f":"BQ160*100/BQ469","v":{"$error":"#DIV/0!"}},{"$f":"BR160*100/BQ469","v":{"$error":"#DIV/0!"}},{"$f":"BS160*100/BS469","v":7.1428571428571432},{"$f":"BT160*100/BS469","v":0},{"$f":"BU160*100/BU469","v":{"$error":"#DIV/0!"}},{"$f":"BV160*100/BU469","v":{"$error":"#DIV/0!"}},{"$f":"BW160*100/BW469","v":{"$error":"#DIV/0!"}},{"$f":"BX160*100/BW469","v":{"$error":"#DIV/0!"}},{"$f":"BY160*100/BY469","v":0},{"$f":"BZ160*100/BY469","v":0}]
[{"$f":"Equipamiento!$AM$479","v":"SERVICIO DE DIÁLISIS PERITONEAL"},null,{"$f":"Equipamiento!$AV$479*25/100/100","v":0},null,null,{"$f":"Equipamiento!$AU$479*25/100/100","v":1.5037593984962405E-2},{"$f":"IF(Equipamiento!$C$480=Equipamiento!$F$480, \"CUMPLE\", \"NO CUMPLE\")","v":"NO CUMPLE"},null,null,null,null,null,null,null,null,null,null,null,null,null,null,null,null,null,null,null,null,null,null,null,null,null,null,null,null,null,null,null,"ÁREA DE TRATAMIENTO DE DIÁLISIS PERITONEAL",null,null,null,"ÁREA DE TRATAMIENTO DE DIÁLISIS PERITONEAL",null,null,null,{"$f":"AU161*100/AU469","v":6.0150375939849621},{"$f":"AV161*100/AU469","v":0},{"$f":"AW161*100/AW469","v":0},{"$f":"AX161*100/AW469","v":0},{"$f":"AY161*100/AY469","v":0},{"$f":"AZ161*100/AY469","v":0},{"$f":"BA161*100/BA469","v":{"$error":"#DIV/0!"}},{"$f":"BB161*100/BA469","v":{"$error":"#DIV/0!"}},{"$f":"BC161*100/BC469","v":33.333333333333336},{"$f":"BD161*100/BC469","v":0},{"$f":"BE161*100/BE469","v":100},{"$f":"BF161*100/BE469","v":0},{"$f":"BG161*100/BG469","v":{"$error":"#DIV/0!"}},{"$f":"BH161*100/BG469","v":{"$error":"#DIV/0!"}},{"$f":"BI161*100/BI469","v":{"$error":"#DIV/0!"}},{"$f":"BJ161*100/BI469","v":{"$error":"#DIV/0!"}},{"$f":"BK161*100/BK469","v":8.3333333333333339},{"$f":"BL161*100/BK469","v":0},{"$f":"BM161*100/BM469","v":0},{"$f":"BN161*100/BM469","v":0},{"$f":"BO161*100/BO469","v":{"$error":"#DIV/0!"}},{"$f":"BP161*100/BO469","v":{"$error":"#DIV/0!"}},{"$f":"BQ161*100/BQ469","v":{"$error":"#DIV/0!"}},{"$f":"BR161*100/BQ469","v":{"$error":"#DIV/0!"}},{"$f":"BS161*100/BS469","v":7.1428571428571432},{"$f":"BT161*100/BS469","v":0},{"$f":"BU161*100/BU469","v":{"$error":"#DIV/0!"}},{"$f":"BV161*100/BU469","v":{"$error":"#DIV/0!"}},{"$f":"BW161*100/BW469","v":{"$error":"#DIV/0!"}},{"$f":"BX161*100/BW469","v":{"$error":"#DIV/0!"}},{"$f":"BY161*100/BY469","v":0},{"$f":"BZ161*100/BY469","v":0}]
[{"$f":"Equipamiento!$AM$480","v":"ÁREA DE TRATAMIENTO DE DIÁLISIS PERITONEAL"},null,null,{"$f":"Equipamiento!$AV$480*25/100/100","v":0},null,{"$f":"Equipamiento!$AU$480*25/100/100","v":1.5037593984962405E-2},{"$f":"IF(Equipamiento!$D$481=Equipamiento!$F$481, \"CUMPLE\", \"NO CUMPLE\")","v":"NO CUMPLE"},null,null,null,null,null,null,null,null,null,null,null,null,null,null,null,null,null,null,null,null,null,null,null,null,null,null,null,null,null,null,null,"ÁREA DE TRATAMIENTO ",null,null,null,"ÁREA DE TRATAMIENTO ",null,null,null,{"$f":"AU162*100/AU469","v":6.0150375939849621},{"$f":"AV162*100/AU469","v":0},{"$f":"AW162*100/AW469","v":0},{"$f":"AX162*100/AW469","v":0},{"$f":"AY162*100/AY469","v":0},{"$f":"AZ162*100/AY469","v":0},{"$f":"BA162*100/BA469","v":{"$error":"#DIV/0!"}},{"$f":"BB162*100/BA469","v":{"$error":"#DIV/0!"}},{"$f":"BC162*100/BC469","v":33.333333333333336},{"$f":"BD162*100/BC469","v":0},{"$f":"BE162*100/BE469","v":50},{"$f":"BF162*100/BE469","v":0},{"$f":"BG162*100/BG469","v":{"$error":"#DIV/0!"}},{"$f":"BH162*100/BG469","v":{"$error":"#DIV/0!"}},{"$f":"BI162*100/BI469","v":{"$error":"#DIV/0!"}},{"$f":"BJ162*100/BI469","v":{"$error":"#DIV/0!"}},{"$f":"BK162*100/BK469","v":8.3333333333333339},{"$f":"BL162*100/BK469","v":0},{"$f":"BM162*100/BM469","v":0},{"$f":"BN162*100/BM469","v":0},{"$f":"BO162*100/BO469","v":{"$error":"#DIV/0!"}},{"$f":"BP162*100/BO469","v":{"$error":"#DIV/0!"}},{"$f":"BQ162*100/BQ469","v":{"$error":"#DIV/0!"}},{"$f":"BR162*100/BQ469","v":{"$error":"#DIV/0!"}},{"$f":"BS162*100/BS469","v":7.1428571428571432},{"$f":"BT162*100/BS469","v":0},{"$f":"BU162*100/BU469","v":{"$error":"#DIV/0!"}},{"$f":"BV162*100/BU469","v":{"$error":"#DIV/0!"}},{"$f":"BW162*100/BW469","v":{"$error":"#DIV/0!"}},{"$f":"BX162*100/BW469","v":{"$error":"#DIV/0!"}},{"$f":"BY162*100/BY469","v":0},{"$f":"BZ162*100/BY469","v":0}]
[{"$f":"Equipamiento!$AM$481","v":"ÁREA DE TRATAMIENTO "},null,null,null,{"$f":"Equipamiento!$AV$481*25/100/100","v":0},{"$f":"Equipamiento!$AU$481*25/100/100","v":1.5037593984962405E-2},{"$f":"IF(Equipamiento!$E$482=Equipamiento!$F$482, \"CUMPLE\", \"NO CUMPLE\")","v":"NO CUMPLE"},null,null,null,null,null,null,null,null,null,null,null,null,null,null,null,null,null,null,null,null,null,null,null,null,null,null,null,null,null,null,null,"ÁREA TÉCNICA",null,null,null,"ÁREA TÉCNICA",null,null,null,{"$f":"AU179*100/AU469","v":0},{"$f":"AV179*100/AU469","v":0},{"$f":"AW179*100/AW469","v":0},{"$f":"AX179*100/AW469","v":0},{"$f":"AY179*100/AY469","v":0},{"$f":"AZ179*100/AY469","v":0},{"$f":"BA179*100/BA469","v":{"$error":"#DIV/0!"}},{"$f":"BB179*100/BA469","v":{"$error":"#DIV/0!"}},{"$f":"BC179*100/BC469","v":0},{"$f":"BD179*100/BC469","v":0},{"$f":"BE179*100/BE469","v":50},{"$f":"BF179*100/BE469","v":0},{"$f":"BG179*100/BG469","v":{"$error":"#DIV/0!"}},{"$f":"BH179*100/BG469","v":{"$error":"#DIV/0!"}},{"$f":"BI179*100/BI469","v":{"$error":"#DIV/0!"}},{"$f":"BJ179*100/BI469","v":{"$error":"#DIV/0!"}},{"$f":"BK179*100/BK469","v":0},{"$f":"BL179*100/BK469","v":0},{"$f":"BM179*100/BM469","v":0},{"$f":"BN179*100/BM469","v":0},{"$f":"BO179*100/BO469","v":{"$error":"#DIV/0!"}},{"$f":"BP179*100/BO469","v":{"$error":"#DIV/0!"}},{"$f":"BQ179*100/BQ469","v":{"$error":"#DIV/0!"}},{"$f":"BR179*100/BQ469","v":{"$error":"#DIV/0!"}},{"$f":"BS179*100/BS469","v":0},{"$f":"BT179*100/BS469","v":0},{"$f":"BU179*100/BU469","v":{"$error":"#DIV/0!"}},{"$f":"BV179*100/BU469","v":{"$error":"#DIV/0!"}},{"$f":"BW179*100/BW469","v":{"$error":"#DIV/0!"}},{"$f":"BX179*100/BW469","v":{"$error":"#DIV/0!"}},{"$f":"BY179*100/BY469","v":0},{"$f":"BZ179*100/BY469","v":0}]
[{"$f":"Equipamiento!$AM$482","v":"ÁREA TÉCNICA"},null,null,null,{"$f":"Equipamiento!$AV$482*25/100/100","v":0},{"$f":"Equipamiento!$AU$482*25/100/100","v":0},{"$f":"IF(Equipamiento!$E$483=Equipamiento!$F$483, \"CUMPLE\", \"NO CUMPLE\")","v":"CUMPLE"},null,null,null,null,null,null,null,null,null,null,null,null,null,null,null,null,null,null,null,null,null,null,null,null,null,null,null,null,null,null,null,"SERVICIO DE DIAGNÓSTICO",null,null,null,"SERVICIO DE DIAGNÓSTICO",null,null,null,{"$f":"AU192*100/AU469","v":0},{"$f":"AV192*100/AU469","v":0},{"$f":"AW192*100/AW469","v":0},{"$f":"AX192*100/AW469","v":0},{"$f":"AY192*100/AY469","v":0},{"$f":"AZ192*100/AY469","v":0},{"$f":"BA192*100/BA469","v":{"$error":"#DIV/0!"}},{"$f":"BB192*100/BA469","v":{"$error":"#DIV/0!"}},{"$f":"BC192*100/BC469","v":0},{"$f":"BD192*100/BC469","v":0},{"$f":"BE192*100/BE469","v":0},{"$f":"BF192*100/BE469","v":0},{"$f":"BG192*100/BG469","v":{"$error":"#DIV/0!"}},{"$f":"BH192*100/BG469","v":{"$error":"#DIV/0!"}},{"$f":"BI192*100/BI469","v":{"$error":"#DIV/0!"}},{"$f":"BJ192*100/BI469","v":{"$error":"#DIV/0!"}},{"$f":"BK192*100/BK469","v":0},{"$f":"BL192*100/BK469","v":0},{"$f":"BM192*100/BM469","v":20},{"$f":"BN192*100/BM469","v":0},{"$f":"BO192*100/BO469","v":{"$error":"#DIV/0!"}},{"$f":"BP192*100/BO469","v":{"$error":"#DIV/0!"}},{"$f":"BQ192*100/BQ469","v":{"$error":"#DIV/0!"}},{"$f":"BR192*100/BQ469","v":{"$error":"#DIV/0!"}},{"$f":"BS192*100/BS469","v":0},{"$f":"BT192*100/BS469","v":0},{"$f":"BU192*100/BU469","v":{"$error":"#DIV/0!"}},{"$f":"BV192*100/BU469","v":{"$error":"#DIV/0!"}},{"$f":"BW192*100/BW469","v":{"$error":"#DIV/0!"}},{"$f":"BX192*100/BW469","v":{"$error":"#DIV/0!"}},{"$f":"BY192*100/BY469","v":100},{"$f":"BZ192*100/BY469","v":0}]
[{"$f":"Equipamiento!$AM$483","v":"SERVICIO DE DIAGNÓSTICO"},null,{"$f":"Equipamiento!$AV$483*25/100/100","v":0},null,null,{"$f":"Equipamiento!$AU$483*25/100/100","v":0},{"$f":"IF(Equipamiento!$C$484=Equipamiento!$F$484, \"CUMPLE\", \"NO CUMPLE\")","v":"CUMPLE"},null,null,null,null,null,null,null,null,null,null,null,null,null,null,null,null,null,null,null,null,null,null,null,null,null,null,null,null,null,null,null,"LABORATORIO - PUESTO DE TOMA DE MUESTRAS",null,null,null,"LABORATORIO - PUESTO DE TOMA DE MUESTRAS",null,null,null,{"$f":"AU193*100/AU469","v":0},{"$f":"AV193*100/AU469","v":0},{"$f":"AW193*100/AW469","v":0},{"$f":"AX193*100/AW469","v":0},{"$f":"AY193*100/AY469","v":0},{"$f":"AZ193*100/AY469","v":0},{"$f":"BA193*100/BA469","v":{"$error":"#DIV/0!"}},{"$f":"BB193*100/BA469","v":{"$error":"#DIV/0!"}},{"$f":"BC193*100/BC469","v":0},{"$f":"BD193*100/BC469","v":0},{"$f":"BE193*100/BE469","v":0},{"$f":"BF193*100/BE469","v":0},{"$f":"BG193*100/BG469","v":{"$error":"#DIV/0!"}},{"$f":"BH193*100/BG469","v":{"$error":"#DIV/0!"}},{"$f":"BI193*100/BI469","v":{"$error":"#DIV/0!"}},{"$f":"BJ193*100/BI469","v":{"$error":"#DIV/0!"}},{"$f":"BK193*100/BK469","v":0},{"$f":"BL193*100/BK469","v":0},{"$f":"BM193*100/BM469","v":20},{"$f":"BN193*100/BM469","v":0},{"$f":"BO193*100/BO469","v":{"$error":"#DIV/0!"}},{"$f":"BP193*100/BO469","v":{"$error":"#DIV/0!"}},{"$f":"BQ193*100/BQ469","v":{"$error":"#DIV/0!"}},{"$f":"BR193*100/BQ469","v":{"$error":"#DIV/0!"}},{"$f":"BS193*100/BS469","v":0},{"$f":"BT193*100/BS469","v":0},{"$f":"BU193*100/BU469","v":{"$error":"#DIV/0!"}},{"$f":"BV193*100/BU469","v":{"$error":"#DIV/0!"}},{"$f":"BW193*100/BW469","v":{"$error":"#DIV/0!"}},{"$f":"BX193*100/BW469","v":{"$error":"#DIV/0!"}},{"$f":"BY193*100/BY469","v":100},{"$f":"BZ193*100/BY469","v":0}]
[{"$f":"Equipamiento!$AM$484","v":"LABORATORIO - PUESTO DE TOMA DE MUESTRAS"},null,null,{"$f":"Equipamiento!$AV$484*25/100/100","v":0},null,{"$f":"Equipamiento!$AU$484*25/100/100","v":0},{"$f":"IF(Equipamiento!$D$485=Equipamiento!$F$485, \"CUMPLE\", \"NO CUMPLE\")","v":"CUMPLE"},null,null,null,null,null,null,null,null,null,null,null,null,null,null,null,null,null,null,null,null,null,null,null,null,null,null,null,null,null,null,null,"ÁREA DE TOMA DE MUESTRAS",null,null,null,"ÁREA DE TOMA DE MUESTRAS",null,null,null,{"$f":"AU194*100/AU469","v":0},{"$f":"AV194*100/AU469","v":0},{"$f":"AW194*100/AW469","v":0},{"$f":"AX194*100/AW469","v":0},{"$f":"AY194*100/AY469","v":0},{"$f":"AZ194*100/AY469","v":0},{"$f":"BA194*100/BA469","v":{"$error":"#DIV/0!"}},{"$f":"BB194*100/BA469","v":{"$error":"#DIV/0!"}},{"$f":"BC194*100/BC469","v":0},{"$f":"BD194*100/BC469","v":0},{"$f":"BE194*100/BE469","v":0},{"$f":"BF194*100/BE469","v":0},{"$f":"BG194*100/BG469","v":{"$error":"#DIV/0!"}},{"$f":"BH194*100/BG469","v":{"$error":"#DIV/0!"}},{"$f":"BI194*100/BI469","v":{"$error":"#DIV/0!"}},{"$f":"BJ194*100/BI469","v":{"$error":"#DIV/0!"}},{"$f":"BK194*100/BK469","v":0},{"$f":"BL194*100/BK469","v":0},{"$f":"BM194*100/BM469","v":20},{"$f":"BN194*100/BM469","v":0},{"$f":"BO194*100/BO469","v":{"$error":"#DIV/0!"}},{"$f":"BP194*100/BO469","v":{"$error":"#DIV/0!"}},{"$f":"BQ194*100/BQ469","v":{"$error":"#DIV/0!"}},{"$f":"BR194*100/BQ469","v":{"$error":"#DIV/0!"}},{"$f":"BS194*100/BS469","v":0},{"$f":"BT194*100/BS469","v":0},{"$f":"BU194*100/BU469","v":{"$error":"#DIV/0!"}},{"$f":"BV194*100/BU469","v":{"$error":"#DIV/0!"}},{"$f":"BW194*100/BW469","v":{"$error":"#DIV/0!"}},{"$f":"BX194*100/BW469","v":{"$error":"#DIV/0!"}},{"$f":"BY194*100/BY469","v":0},{"$f":"BZ194*100/BY469","v":0}]
[{"$f":"Equipamiento!$AM$485","v":"ÁREA DE TOMA DE MUESTRAS"},null,null,null,{"$f":"Equipamiento!$AV$485*25/100/100","v":0},{"$f":"Equipamiento!$AU$485*25/100/100","v":0},{"$f":"IF(Equipamiento!$E$486=Equipamiento!$F$486, \"CUMPLE\", \"NO CUMPLE\")","v":"CUMPLE"},null,null,null,null,null,null,null,null,null,null,null,null,null,null,null,null,null,null,null,null,null,null,null,null,null,null,null,null,null,null,null,"ÁREA DE PROCESAMIENTO",null,null,null,"ÁREA DE PROCESAMIENTO",null,null,null,{"$f":"AU225*100/AU469","v":0},{"$f":"AV225*100/AU469","v":0},{"$f":"AW225*100/AW469","v":0},{"$f":"AX225*100/AW469","v":0},{"$f":"AY225*100/AY469","v":0},{"$f":"AZ225*100/AY469","v":0},{"$f":"BA225*100/BA469","v":{"$error":"#DIV/0!"}},{"$f":"BB225*100/BA469","v":{"$error":"#DIV/0!"}},{"$f":"BC225*100/BC469","v":0},{"$f":"BD225*100/BC469","v":0},{"$f":"BE225*100/BE469","v":0},{"$f":"BF225*100/BE469","v":0},{"$f":"BG225*100/BG469","v":{"$error":"#DIV/0!"}},{"$f":"BH225*100/BG469","v":{"$error":"#DIV/0!"}},{"$f":"BI225*100/BI469","v":{"$error":"#DIV/0!"}},{"$f":"BJ225*100/BI469","v":{"$error":"#DIV/0!"}},{"$f":"BK225*100/BK469","v":0},{"$f":"BL225*100/BK469","v":0},{"$f":"BM225*100/BM469","v":0},{"$f":"BN225*100/BM469","v":0},{"$f":"BO225*100/BO469","v":{"$error":"#DIV/0!"}},{"$f":"BP225*100/BO469","v":{"$error":"#DIV/0!"}},{"$f":"BQ225*100/BQ469","v":{"$error":"#DIV/0!"}},{"$f":"BR225*100/BQ469","v":{"$error":"#DIV/0!"}},{"$f":"BS225*100/BS469","v":0},{"$f":"BT225*100/BS469","v":0},{"$f":"BU225*100/BU469","v":{"$error":"#DIV/0!"}},{"$f":"BV225*100/BU469","v":{"$error":"#DIV/0!"}},{"$f":"BW225*100/BW469","v":{"$error":"#DIV/0!"}},{"$f":"BX225*100/BW469","v":{"$error":"#DIV/0!"}},{"$f":"BY225*100/BY469","v":100},{"$f":"BZ225*100/BY469","v":0}]
[{"$f":"Equipamiento!$AM$486","v":"ÁREA DE PROCESAMIENTO"},null,null,null,{"$f":"Equipamiento!$AV$486*25/100/100","v":0},{"$f":"Equipamiento!$AU$486*25/100/100","v":0},{"$f":"IF(Equipamiento!$E$487=Equipamiento!$F$487, \"CUMPLE\", \"NO CUMPLE\")","v":"CUMPLE"},null,null,null,null,null,null,null,null,null,null,null,null,null,null,null,null,null,null,null,null,null,null,null,null,null,null,null,null,null,null,null,"SERVICIOS DE APOYO",null,null,null,"SERVICIOS DE APOYO",null,null,null,{"$f":"AU232*100/AU469","v":14.285714285714286},{"$f":"AV232*100/AU469","v":0},{"$f":"AW232*100/AW469","v":0},{"$f":"AX232*100/AW469","v":0},{"$f":"AY232*100/AY469","v":50},{"$f":"AZ232*100/AY469","v":0},{"$f":"BA232*100/BA469","v":{"$error":"#DIV/0!"}},{"$f":"BB232*100/BA469","v":{"$error":"#DIV/0!"}},{"$f":"BC232*100/BC469","v":0},{"$f":"BD232*100/BC469","v":0},{"$f":"BE232*100/BE469","v":0},{"$f":"BF232*100/BE469","v":0},{"$f":"BG232*100/BG469","v":{"$error":"#DIV/0!"}},{"$f":"BH232*100/BG469","v":{"$error":"#DIV/0!"}},{"$f":"BI232*100/BI469","v":{"$error":"#DIV/0!"}},{"$f":"BJ232*100/BI469","v":{"$error":"#DIV/0!"}},{"$f":"BK232*100/BK469","v":25},{"$f":"BL232*100/BK469","v":0},{"$f":"BM232*100/BM469","v":60},{"$f":"BN232*100/BM469","v":0},{"$f":"BO232*100/BO469","v":{"$error":"#DIV/0!"}},{"$f":"BP232*100/BO469","v":{"$error":"#DIV/0!"}},{"$f":"BQ232*100/BQ469","v":{"$error":"#DIV/0!"}},{"$f":"BR232*100/BQ469","v":{"$error":"#DIV/0!"}},{"$f":"BS232*100/BS469","v":14.285714285714286},{"$f":"BT232*100/BS469","v":0},{"$f":"BU232*100/BU469","v":{"$error":"#DIV/0!"}},{"$f":"BV232*100/BU469","v":{"$error":"#DIV/0!"}},{"$f":"BW232*100/BW469","v":{"$error":"#DIV/0!"}},{"$f":"BX232*100/BW469","v":{"$error":"#DIV/0!"}},{"$f":"BY232*100/BY469","v":0},{"$f":"BZ232*100/BY469","v":0}]
[{"$f":"AM487","v":"SERVICIOS DE APOYO"},null,{"$f":"Equipamiento!$AV$487*25/100/100","v":0},null,null,{"$f":"Equipamiento!$AU$487*25/100/100","v":3.5714285714285719E-2},{"$f":"IF(Equipamiento!$C$488=Equipamiento!$F$488, \"CUMPLE\", \"NO CUMPLE\")","v":"NO CUMPLE"},null,null,null,null,null,null,null,null,null,null,null,null,null,null,null,null,null,null,null,null,null,null,null,null,null,null,null,null,null,null,null,"FARMACIA",null,null,null,"FARMACIA",null,null,null,{"$f":"AU233*100/AU469","v":10.526315789473685},{"$f":"AV233*100/AU469","v":0},{"$f":"AW233*100/AW469","v":0},{"$f":"AX233*100/AW469","v":0},{"$f":"AY233*100/AY469","v":37.5},{"$f":"AZ233*100/AY469","v":0},{"$f":"BA233*100/BA469","v":{"$error":"#DIV/0!"}},{"$f":"BB233*100/BA469","v":{"$error":"#DIV/0!"}},{"$f":"BC233*100/BC469","v":0},{"$f":"BD233*100/BC469","v":0},0,{"$f":"BF233*100/BE469","v":0},{"$f":"BG233*100/BG469","v":{"$error":"#DIV/0!"}},{"$f":"BH233*100/BG469","v":{"$error":"#DIV/0!"}},{"$error":"#DIV/0!"},{"$f":"BJ233*100/BI469","v":{"$error":"#DIV/0!"}},{"$f":"BK233*100/BK469","v":16.666666666666668},{"$f":"BL233*100/BK469","v":0},60,{"$f":"BN233*100/BM469","v":0},{"$f":"BO233*100/BO469","v":{"$error":"#DIV/0!"}},{"$f":"BP233*100/BO469","v":{"$error":"#DIV/0!"}},{"$error":"#DIV/0!"},{"$f":"BR233*100/BQ469","v":{"$error":"#DIV/0!"}},{"$f":"BS233*100/BS469","v":14.285714285714286},{"$f":"BT233*100/BS469","v":0},{"$error":"#DIV/0!"},{"$f":"BV233*100/BU469","v":{"$error":"#DIV/0!"}},{"$f":"BW233*100/BW469","v":{"$error":"#DIV/0!"}},{"$f":"BX233*100/BW469","v":{"$error":"#DIV/0!"}},0,{"$f":"BZ233*100/BY469","v":0}]
["FARMACIA",null,null,{"$f":"Equipamiento!$AV$488*25/100/100","v":0},null,{"$f":"Equipamiento!$AU$488*25/100/100","v":2.6315789473684213E-2},{"$f":"IF(Equipamiento!$D$489=Equipamiento!$F$489, \"CUMPLE\", \"NO CUMPLE\")","v":"NO CUMPLE"},null,null,null,null,null,null,null,null,null,null,null,null,null,null,null,null,null,null,null,null,null,null,null,null,null,null,null,null,null,null,null,"ÁREA ADMINISTRATIVA Y DE PERSONAL",null,null,null,"ÁREA ADMINISTRATIVA Y DE PERSONAL",null,null,null,{"$f":"AU234*100/AU469","v":4.511278195488722},{"$f":"AV234*100/AU469","v":0},{"$f":"AW234*100/AW469","v":0},{"$f":"AX234*100/AW469","v":0},{"$f":"AY234*100/AY469","v":37.5},{"$f":"AZ234*100/AY469","v":0},{"$f":"BA234*100/BA469","v":{"$error":"#DIV/0!"}},{"$f":"BB234*100/BA469","v":{"$error":"#DIV/0!"}},{"$f":"BC234*100/BC469","v":0},{"$f":"BD234*100/BC469","v":0},{"$f":"BE234*100/BE469","v":0},{"$f":"BF234*100/BE469","v":0},{"$f":"BG234*100/BG469","v":{"$error":"#DIV/0!"}},{"$f":"BH234*100/BG469","v":{"$error":"#DIV/0!"}},{"$f":"BI234*100/BI469","v":{"$error":"#DIV/0!"}},{"$f":"BJ234*100/BI469","v":{"$error":"#DIV/0!"}},{"$f":"BK234*100/BK469","v":0},{"$f":"BL234*100/BK469","v":0},{"$f":"BM234*100/BM469","v":0},{"$f":"BN234*100/BM469","v":0},{"$f":"BO234*100/BO469","v":{"$error":"#DIV/0!"}},{"$f":"BP234*100/BO469","v":{"$error":"#DIV/0!"}},{"$f":"BQ234*100/BQ469","v":{"$error":"#DIV/0!"}},{"$f":"BR234*100/BQ469","v":{"$error":"#DIV/0!"}},{"$f":"BS234*100/BS469","v":14.285714285714286},{"$f":"BT234*100/BS469","v":0},{"$f":"BU234*100/BU469","v":{"$error":"#DIV/0!"}},{"$f":"BV234*100/BU469","v":{"$error":"#DIV/0!"}},{"$f":"BW234*100/BW469","v":{"$error":"#DIV/0!"}},{"$f":"BX234*100/BW469","v":{"$error":"#DIV/0!"}},{"$f":"BY234*100/BY469","v":0},{"$f":"BZ234*100/BY469","v":0}]
["ÁREA ADMINISTRATIVA Y DE PERSONAL",null,null,null,{"$f":"Equipamiento!$AV$489*25/100/100","v":0},{"$f":"Equipamiento!$AU$489*25/100/100","v":1.1278195488721806E-2},{"$f":"IF(Equipamiento!$E$490=Equipamiento!$F$490, \"CUMPLE\", \"NO CUMPLE\")","v":"NO CUMPLE"},null,null,null,null,null,null,null,null,null,null,null,null,null,null,null,null,null,null,null,null,null,null,null,null,null,null,null,null,null,null,null,"ÁREA DE RECEPCIÓN, ALMACENAMIENTO Y SUMINISTRO (CON CONTROL DE ACCESO)",null,null,null,"ÁREA DE RECEPCIÓN, ALMACENAMIENTO Y SUMINISTRO (CON CONTROL DE ACCESO)",null,null,null,{"$f":"AU270*100/AU469","v":1.5037593984962405},{"$f":"AV270*100/AU469","v":0},{"$f":"AW270*100/AW469","v":0},{"$f":"AX270*100/AW469","v":0},{"$f":"AY270*100/AY469","v":0},{"$f":"AZ270*100/AY469","v":0},{"$f":"BA270*100/BA469","v":{"$error":"#DIV/0!"}},{"$f":"BB270*100/BA469","v":{"$error":"#DIV/0!"}},{"$f":"BC270*100/BC469","v":0},{"$f":"BD270*100/BC469","v":0},{"$f":"BE270*100/BE469","v":0},{"$f":"BF270*100/BE469","v":0},{"$f":"BG270*100/BG469","v":{"$error":"#DIV/0!"}},{"$f":"BH270*100/BG469","v":{"$error":"#DIV/0!"}},{"$f":"BI270*100/BI469","v":{"$error":"#DIV/0!"}},{"$f":"BJ270*100/BI469","v":{"$error":"#DIV/0!"}},{"$f":"BK270*100/BK469","v":0},{"$f":"BL270*100/BK469","v":0},{"$f":"BM270*100/BM469","v":0},{"$f":"BN270*100/BM469","v":0},{"$f":"BO270*100/BO469","v":{"$error":"#DIV/0!"}},{"$f":"BP270*100/BO469","v":{"$error":"#DIV/0!"}},{"$f":"BQ270*100/BQ469","v":{"$error":"#DIV/0!"}},{"$f":"BR270*100/BQ469","v":{"$error":"#DIV/0!"}},{"$f":"BS270*100/BS469","v":0},{"$f":"BT270*100/BS469","v":0},{"$f":"BU270*100/BU469","v":{"$error":"#DIV/0!"}},{"$f":"BV270*100/BU469","v":{"$error":"#DIV/0!"}},{"$f":"BW270*100/BW469","v":{"$error":"#DIV/0!"}},{"$f":"BX270*100/BW469","v":{"$error":"#DIV/0!"}},{"$f":"BY270*100/BY469","v":0},{"$f":"BZ270*100/BY469","v":0}]
["ÁREA DE RECEPCIÓN, ALMACENAMIENTO Y SUMINISTRO (CON CONTROL DE ACCESO)",null,null,null,{"$f":"Equipamiento!$AV$490*25/100/100","v":0},{"$f":"Equipamiento!$AU$490*25/100/100","v":3.7593984962406013E-3},{"$f":"IF(Equipamiento!$E$491=Equipamiento!$F$491, \"CUMPLE\", \"NO CUMPLE\")","v":"NO CUMPLE"},null,null,null,null,null,null,null,null,null,null,null,null,null,null,null,null,null,null,null,null,null,null,null,null,null,null,null,null,null,null,null,"ÁREA TECNICA",null,null,null,"ÁREA TECNICA",null,null,null,{"$f":"AU284*100/AU469","v":4.511278195488722},{"$f":"AV284*100/AU469","v":0},{"$f":"AW284*100/AW469","v":0},{"$f":"AW284*100/AW469","v":0},{"$f":"AY284*100/AY469","v":0},{"$f":"AY284*100/AY469","v":0},{"$f":"BA284*100/BA469","v":{"$error":"#DIV/0!"}},{"$f":"BA284*100/BA469","v":{"$error":"#DIV/0!"}},{"$f":"BC284*100/BC469","v":0},{"$f":"BC284*100/BC469","v":0},{"$f":"BE284*100/BE469","v":0},{"$f":"BE284*100/BE469","v":0},{"$f":"BG284*100/BG469","v":{"$error":"#DIV/0!"}},{"$f":"BG284*100/BG469","v":{"$error":"#DIV/0!"}},{"$f":"BI284*100/BI469","v":{"$error":"#DIV/0!"}},{"$f":"BI284*100/BI469","v":{"$error":"#DIV/0!"}},{"$f":"BK284*100/BK469","v":16.666666666666668},{"$f":"BK284*100/BK469","v":16.666666666666668},{"$f":"BM284*100/BM469","v":60},{"$f":"BM284*100/BM469","v":60},{"$f":"BO284*100/BO469","v":{"$error":"#DIV/0!"}},{"$f":"BO284*100/BO469","v":{"$error":"#DIV/0!"}},{"$f":"BQ284*100/BQ469","v":{"$error":"#DIV/0!"}},{"$f":"BQ284*100/BQ469","v":{"$error":"#DIV/0!"}},{"$f":"BS284*100/BS469","v":0},{"$f":"BS284*100/BS469","v":0},{"$f":"BU284*100/BU469","v":{"$error":"#DIV/0!"}},{"$f":"BU284*100/BU469","v":{"$error":"#DIV/0!"}},{"$f":"BW284*100/BW469","v":{"$error":"#DIV/0!"}},{"$f":"BW284*100/BW469","v":{"$error":"#DIV/0!"}},{"$f":"BY284*100/BY469","v":0},{"$f":"BY284*100/BY469","v":0}]
["ÁREA TECNICA",null,null,null,{"$f":"Equipamiento!$AV$491*25/100/100","v":0},{"$f":"Equipamiento!$AU$491*25/100/100","v":1.1278195488721806E-2},{"$f":"IF(Equipamiento!$E$492=Equipamiento!$F$492, \"CUMPLE\", \"NO CUMPLE\")","v":"NO CUMPLE"},null,null,null,null,null,null,null,null,null,null,null,null,null,null,null,null,null,null,null,null,null,null,null,null,null,null,null,null,null,null,null,"INFORMÁTICA",null,null,null,"INFORMÁTICA",null,null,null,{"$f":"AU300*100/AU469","v":0},{"$f":"AV300*100/AU469","v":0},{"$f":"AW300*100/AW469","v":0},{"$f":"AW300*100/AW469","v":0},{"$f":"AY300*100/AY469","v":0},{"$f":"AY300*100/AY469","v":0},{"$f":"BA300*100/BA469","v":{"$error":"#DIV/0!"}},{"$f":"BA300*100/BA469","v":{"$error":"#DIV/0!"}},{"$f":"BC300*100/BC469","v":0},{"$f":"BC300*100/BC469","v":0},0,0,{"$f":"BG300*100/BG469","v":{"$error":"#DIV/0!"}},{"$f":"BG300*100/BG469","v":{"$error":"#DIV/0!"}},{"$f":"BI300*100/BI469","v":{"$error":"#DIV/0!"}},{"$f":"BI300*100/BI469","v":{"$error":"#DIV/0!"}},0,0,{"$f":"BM300*100/BM469","v":0},{"$f":"BM300*100/BM469","v":0},{"$f":"BO300*100/BO469","v":{"$error":"#DIV/0!"}},{"$f":"BO300*100/BO469","v":{"$error":"#DIV/0!"}},{"$error":"#DIV/0!"},{"$error":"#DIV/0!"},{"$f":"BS300*100/BS469","v":0},{"$f":"BS300*100/BS469","v":0},{"$f":"BU300*100/BU469","v":{"$error":"#DIV/0!"}},{"$f":"BU300*100/BU469","v":{"$error":"#DIV/0!"}},{"$error":"#DIV/0!"},{"$error":"#DIV/0!"},{"$f":"BY300*100/BY469","v":0},{"$f":"BY300*100/BY469","v":0}]
["INFORMÁTICA",null,null,{"$f":"Equipamiento!$AV$492*25/100/100","v":0},null,{"$f":"Equipamiento!$AU$492*25/100/100","v":0},{"$f":"IF(Equipamiento!$D$493=Equipamiento!$F$493, \"CUMPLE\", \"NO CUMPLE\")","v":"CUMPLE"},null,null,null,null,null,null,null,null,null,null,null,null,null,null,null,null,null,null,null,null,null,null,null,null,null,null,null,null,null,null,null,"ÁREA TÉCNICA",null,null,null,"ÁREA TÉCNICA",null,null,null,{"$f":"AU301*100/AU469","v":0},{"$f":"AV301*100/AU469","v":0},{"$f":"AW301*100/AW469","v":0},{"$f":"AW301*100/AW469","v":0},{"$f":"AY301*100/AY469","v":0},{"$f":"AY301*100/AY469","v":0},{"$f":"BA301*100/BA469","v":{"$error":"#DIV/0!"}},{"$f":"BA301*100/BB469","v":{"$error":"#DIV/0!"}},{"$f":"BC301*100/BC469","v":0},{"$f":"BC301*100/BC469","v":0},{"$f":"BE301*100/BE469","v":0},{"$f":"BE301*100/BF469","v":{"$error":"#DIV/0!"}},{"$f":"BG301*100/BG469","v":{"$error":"#DIV/0!"}},{"$f":"BG301*100/BG469","v":{"$error":"#DIV/0!"}},{"$f":"BI301*100/BI469","v":{"$error":"#DIV/0!"}},{"$f":"BI301*100/BJ469","v":{"$error":"#DIV/0!"}},{"$f":"BK301*100/BK469","v":0},{"$f":"BK301*100/BK469","v":0},{"$f":"BM301*100/BM469","v":0},{"$f":"BM301*100/BN469","v":{"$error":"#DIV/0!"}},{"$f":"BO301*100/BO469","v":{"$error":"#DIV/0!"}},{"$f":"BO301*100/BO469","v":{"$error":"#DIV/0!"}},{"$f":"BQ301*100/BQ469","v":{"$error":"#DIV/0!"}},{"$f":"BQ301*100/BR469","v":{"$error":"#DIV/0!"}},{"$f":"BS301*100/BS469","v":0},{"$f":"BS301*100/BS469","v":0},{"$f":"BU301*100/BU469","v":{"$error":"#DIV/0!"}},{"$f":"BU301*100/BU469","v":{"$error":"#DIV/0!"}},{"$f":"BW301*100/BW469","v":{"$error":"#DIV/0!"}},{"$f":"BW301*100/BW469","v":{"$error":"#DIV/0!"}},{"$f":"BY301*100/BY469","v":0},{"$f":"BY301*100/BY469","v":0}]
["ÁREA TÉCNICA",null,null,null,{"$f":"Equipamiento!$AV$493*25/100/100","v":0},{"$f":"Equipamiento!$AU$493*25/100/100","v":0},{"$f":"IF(Equipamiento!$E$494=Equipamiento!$F$494, \"CUMPLE\", \"NO CUMPLE\")","v":"CUMPLE"},null,null,null,null,null,null,null,null,null,null,null,null,null,null,null,null,null,null,null,null,null,null,null,null,null,null,null,null,null,null,null,"REGISTROS Y ARCHIVOS CLÍNICOS",null,null,null,"REGISTROS Y ARCHIVOS CLÍNICOS",null,null,null,{"$f":"AU310*100/AU469","v":3.7593984962406015},{"$f":"AV310*100/AU469","v":0},{"$f":"AW310*100/AW469","v":0},{"$f":"AX310*100/AW469","v":0},{"$f":"AY310*100/AY469","v":12.5},{"$f":"AZ310*100/AY469","v":0},{"$f":"BA310*100/BA469","v":{"$error":"#DIV/0!"}},{"$f":"BB310*100/BA469","v":{"$error":"#DIV/0!"}},{"$f":"BC310*100/BC469","v":0},{"$f":"BD310*100/BC469","v":0},{"$f":"BE310*100/BE469","v":0},{"$f":"BF310*100/BE469","v":0},{"$f":"BG310*100/BG469","v":{"$error":"#DIV/0!"}},{"$f":"BH310*100/BG469","v":{"$error":"#DIV/0!"}},{"$f":"BI310*100/BI469","v":{"$error":"#DIV/0!"}},{"$f":"BJ310*100/BI469","v":{"$error":"#DIV/0!"}},{"$f":"BK310*100/BK469","v":8.3333333333333339},{"$f":"BL310*100/BK469","v":0},{"$f":"BM310*100/BM469","v":0},{"$f":"BN310*100/BM469","v":0},{"$f":"BO310*100/BO469","v":{"$error":"#DIV/0!"}},{"$f":"BP310*100/BO469","v":{"$error":"#DIV/0!"}},{"$f":"BQ310*100/BQ469","v":{"$error":"#DIV/0!"}},{"$f":"BR310*100/BQ469","v":{"$error":"#DIV/0!"}},{"$f":"BS310*100/BS469","v":0},{"$f":"BT310*100/BS469","v":0},{"$f":"BU310*100/BU469","v":{"$error":"#DIV/0!"}},{"$f":"BV310*100/BU469","v":{"$error":"#DIV/0!"}},{"$f":"BW310*100/BW469","v":{"$error":"#DIV/0!"}},{"$f":"BX310*100/BW469","v":{"$error":"#DIV/0!"}},{"$f":"BY310*100/BY469","v":0},{"$f":"BZ310*100/BY469","v":0}]
[{"$f":"Equipamiento!$AM$494","v":"REGISTROS Y ARCHIVOS CLÍNICOS"},null,null,{"$f":"Equipamiento!$AV$494*25/100/100","v":0},null,{"$f":"Equipamiento!$AU$494*25/100/100","v":9.3984962406015032E-3},{"$f":"IF(Equipamiento!$D$495=Equipamiento!$F$495, \"CUMPLE\", \"NO CUMPLE\")","v":"NO CUMPLE"},null,null,null,null,null,null,null,null,null,null,null,null,null,null,null,null,null,null,null,null,null,null,null,null,null,null,null,null,null,null,null,"ÁREA DE ARCHIVO",null,null,null,"ÁREA DE ARCHIVO",null,null,null,{"$f":"AU311*100/AU469","v":0.75187969924812026},{"$f":"AV311*100/AU469","v":0},{"$f":"AW311*100/AW469","v":0},{"$f":"AX311*100/AW469","v":0},{"$f":"AY311*100/AY469","v":0},{"$f":"AZ311*100/AY469","v":0},{"$f":"BA311*100/BA469","v":{"$error":"#DIV/0!"}},{"$f":"BB311*100/BA469","v":{"$error":"#DIV/0!"}},{"$f":"BC311*100/BC469","v":0},{"$f":"BD311*100/BC469","v":0},{"$f":"BE311*100/BE469","v":0},{"$f":"BF311*100/BE469","v":0},{"$f":"BG311*100/BG469","v":{"$error":"#DIV/0!"}},{"$f":"BH311*100/BG469","v":{"$error":"#DIV/0!"}},{"$f":"BI311*100/BI469","v":{"$error":"#DIV/0!"}},{"$f":"BJ311*100/BI469","v":{"$error":"#DIV/0!"}},{"$f":"BK311*100/BK469","v":0},{"$f":"BL311*100/BK469","v":0},{"$f":"BM311*100/BM469","v":0},{"$f":"BN311*100/BM469","v":0},{"$f":"BO311*100/BO469","v":{"$error":"#DIV/0!"}},{"$f":"BP311*100/BO469","v":{"$error":"#DIV/0!"}},{"$f":"BQ311*100/BQ469","v":{"$error":"#DIV/0!"}},{"$f":"BR311*100/BQ469","v":{"$error":"#DIV/0!"}},{"$f":"BS311*100/BS469","v":0},{"$f":"BT311*100/BS469","v":0},{"$f":"BU311*100/BU469","v":{"$error":"#DIV/0!"}},{"$f":"BV311*100/BU469","v":{"$error":"#DIV/0!"}},{"$f":"BW311*100/BW469","v":{"$error":"#DIV/0!"}},{"$f":"BX311*100/BW469","v":{"$error":"#DIV/0!"}},{"$f":"BY311*100/BY469","v":0},{"$f":"BZ311*100/BY469","v":0}]
[{"$f":"Equipamiento!$AM$495","v":"ÁREA DE ARCHIVO"},null,null,null,{"$f":"Equipamiento!$AV$495*25/100/100","v":0},{"$f":"Equipamiento!$AU$495*25/100/100","v":1.8796992481203006E-3},{"$f":"IF(Equipamiento!$E$496=Equipamiento!$F$496, \"CUMPLE\", \"NO CUMPLE\")","v":"NO CUMPLE"},null,null,null,null,null,null,null,null,null,null,null,null,null,null,null,null,null,null,null,null,null,null,null,null,null,null,null,null,null,null,null,"ÁREA TÉCNICA",null,null,null,"ÁREA TÉCNICA",null,null,null,{"$f":"AU315*100/AU469","v":3.007518796992481},{"$f":"AV315*100/AU469","v":0},{"$f":"AW315*100/AW469","v":0},{"$f":"AX315*100/AW469","v":0},{"$f":"AY315*100/AY469","v":12.5},{"$f":"AZ315*100/AY469","v":0},{"$f":"BA315*100/BA469","v":{"$error":"#DIV/0!"}},{"$f":"BB315*100/BA469","v":{"$error":"#DIV/0!"}},{"$f":"BC315*100/BC469","v":0},{"$f":"BD315*100/BC469","v":0},{"$f":"BE315*100/BE469","v":0},{"$f":"BF315*100/BE469","v":0},{"$f":"BG315*100/BG469","v":{"$error":"#DIV/0!"}},{"$f":"BH315*100/BG469","v":{"$error":"#DIV/0!"}},{"$f":"BI315*100/BI469","v":{"$error":"#DIV/0!"}},{"$f":"BJ315*100/BI469","v":{"$error":"#DIV/0!"}},{"$f":"BK315*100/BK469","v":8.3333333333333339},{"$f":"BL315*100/BK469","v":0},{"$f":"BM315*100/BM469","v":0},{"$f":"BN315*100/BM469","v":0},{"$f":"BO315*100/BO469","v":{"$error":"#DIV/0!"}},{"$f":"BP315*100/BO469","v":{"$error":"#DIV/0!"}},{"$f":"BQ315*100/BQ469","v":{"$error":"#DIV/0!"}},{"$f":"BR315*100/BQ469","v":{"$error":"#DIV/0!"}},{"$f":"BS315*100/BS469","v":0},{"$f":"BT315*100/BS469","v":0},{"$f":"BU315*100/BU469","v":{"$error":"#DIV/0!"}},{"$f":"BV315*100/BU469","v":{"$error":"#DIV/0!"}},{"$f":"BW315*100/BW469","v":{"$error":"#DIV/0!"}},{"$f":"BX315*100/BW469","v":{"$error":"#DIV/0!"}},{"$f":"BY315*100/BY469","v":0},{"$f":"BZ315*100/BY469","v":0}]
[{"$f":"Equipamiento!$AM$496","v":"ÁREA TÉCNICA"},null,null,null,{"$f":"Equipamiento!$AV$496*25/100/100","v":0},{"$f":"Equipamiento!$AU$496*25/100/100","v":7.5187969924812026E-3},{"$f":"IF(Equipamiento!$E$497=Equipamiento!$F$497, \"CUMPLE\", \"NO CUMPLE\")","v":"NO CUMPLE"},null,null,null,null,null,null,null,null,null,null,null,null,null,null,null,null,null,null,null,null,null,null,null,null,null,null,null,null,null,null,null,"SERVICIO DE ADMINISTRACIÓN",null,null,null,"SERVICIO DE ADMINISTRACIÓN",null,null,null,{"$f":"AU328*100/AU469","v":15.789473684210526},{"$f":"AV328*100/AU469","v":0},{"$f":"AW328*100/AW469","v":0},{"$f":"AX328*100/AW469","v":0},{"$f":"AY328*100/AY469","v":37.5},{"$f":"AZ328*100/AY469","v":0},{"$f":"BA328*100/BA469","v":{"$error":"#DIV/0!"}},{"$f":"BB328*100/BA469","v":{"$error":"#DIV/0!"}},{"$f":"BC328*100/BC469","v":50},{"$f":"BD328*100/BC469","v":0},{"$f":"BE328*100/BE469","v":0},{"$f":"BF328*100/BE469","v":0},{"$f":"BG328*100/BG469","v":{"$error":"#DIV/0!"}},{"$f":"BH328*100/BG469","v":{"$error":"#DIV/0!"}},{"$error":"#DIV/0!"},{"$f":"BJ328*100/BI469","v":{"$error":"#DIV/0!"}},8.3333333333333339,{"$f":"BL328*100/BK469","v":0},{"$f":"BM328*100/BM469","v":0},{"$f":"BN328*100/BM469","v":0},{"$error":"#DIV/0!"},{"$f":"BP328*100/BO469","v":{"$error":"#DIV/0!"}},{"$error":"#DIV/0!"},{"$f":"BR328*100/BQ469","v":{"$error":"#DIV/0!"}},{"$f":"BS328*100/BS469","v":7.1428571428571432},{"$f":"BT328*100/BS469","v":0},{"$error":"#DIV/0!"},{"$f":"BV328*100/BU469","v":{"$error":"#DIV/0!"}},{"$error":"#DIV/0!"},{"$f":"BX328*100/BW469","v":{"$error":"#DIV/0!"}},{"$f":"BY328*100/BY469","v":0},{"$f":"BZ328*100/BY469","v":0}]
[{"$f":"Equipamiento!$AM$497","v":"SERVICIO DE ADMINISTRACIÓN"},null,{"$f":"Equipamiento!$AV$497*25/100/100","v":0},null,null,{"$f":"Equipamiento!$AU$497*25/100/100","v":3.9473684210526314E-2},{"$f":"IF(Equipamiento!$C$498=Equipamiento!$F$498, \"CUMPLE\", \"NO CUMPLE\")","v":"NO CUMPLE"},null,null,null,null,null,null,null,null,null,null,null,null,null,null,null,null,null,null,null,null,null,null,null,null,null,null,null,null,null,null,null,"DIRECCIÓN Y GESTIÓN ADMINISTRATIVA",null,null,null,"DIRECCIÓN Y GESTIÓN ADMINISTRATIVA",null,null,null,{"$f":"AU329*100/AU469","v":15.789473684210526},{"$f":"AV329*100/AU469","v":0},{"$f":"AW329*100/AW469","v":0},{"$f":"AX329*100/AW469","v":0},{"$f":"AY329*100/AY469","v":37.5},{"$f":"AZ329*100/AY469","v":0},{"$f":"BA329*100/BA469","v":{"$error":"#DIV/0!"}},{"$f":"BB329*100/BA469","v":{"$error":"#DIV/0!"}},{"$f":"BC329*100/BC469","v":50},{"$f":"BD329*100/BC469","v":0},{"$f":"BE329*100/BE469","v":0},{"$f":"BF329*100/BE469","v":0},{"$f":"BG329*100/BG469","v":{"$error":"#DIV/0!"}},{"$f":"BH329*100/BG469","v":{"$error":"#DIV/0!"}},{"$error":"#DIV/0!"},{"$f":"BJ329*100/BI469","v":{"$error":"#DIV/0!"}},8.3333333333333339,{"$f":"BL329*100/BK469","v":0},{"$f":"BM329*100/BM469","v":0},{"$f":"BN329*100/BM469","v":0},{"$error":"#DIV/0!"},{"$f":"BP329*100/BO469","v":{"$error":"#DIV/0!"}},{"$error":"#DIV/0!"},{"$f":"BR329*100/BQ469","v":{"$error":"#DIV/0!"}},{"$f":"BS329*100/BS469","v":7.1428571428571432},{"$f":"BT329*100/BS469","v":0},{"$error":"#DIV/0!"},{"$f":"BV329*100/BU469","v":{"$error":"#DIV/0!"}},{"$error":"#DIV/0!"},{"$f":"BX329*100/BW469","v":{"$error":"#DIV/0!"}},{"$f":"BY329*100/BY469","v":0},{"$f":"BZ329*100/BY469","v":0}]
[{"$f":"Equipamiento!$AM$498","v":"DIRECCIÓN Y GESTIÓN ADMINISTRATIVA"},null,null,{"$f":"Equipamiento!$AV$498*25/100/100","v":0},null,{"$f":"Equipamiento!$AU$498*25/100/100","v":3.9473684210526314E-2},{"$f":"IF(Equipamiento!$D$499=Equipamiento!$F$499, \"CUMPLE\", \"NO CUMPLE\")","v":"NO CUMPLE"},null,null,null,null,null,null,null,null,null,null,null,null,null,null,null,null,null,null,null,null,null,null,null,null,null,null,null,null,null,null,null,"DIRECCIÓN",null,null,null,"DIRECCIÓN",null,null,null,{"$f":"AU330*100/AU469","v":9.7744360902255636},{"$f":"AV330*100/AU469","v":0},{"$f":"AW330*100/AW469","v":0},{"$f":"AX330*100/AW469","v":0},{"$f":"AY330*100/AY469","v":25},{"$f":"AZ330*100/AY469","v":0},{"$f":"BA330*100/BA469","v":{"$error":"#DIV/0!"}},{"$f":"BB330*100/BA469","v":{"$error":"#DIV/0!"}},{"$f":"BC330*100/BC469","v":50},{"$f":"BD330*100/BC469","v":0},{"$f":"BE330*100/BE469","v":0},{"$f":"BF330*100/BE469","v":0},{"$f":"BG330*100/BG469","v":{"$error":"#DIV/0!"}},{"$f":"BH330*100/BG469","v":{"$error":"#DIV/0!"}},{"$f":"BI330*100/BI469","v":{"$error":"#DIV/0!"}},{"$f":"BJ330*100/BI469","v":{"$error":"#DIV/0!"}},{"$f":"BK330*100/BK469","v":8.3333333333333339},{"$f":"BL330*100/BK469","v":0},{"$f":"BM330*100/BM469","v":0},{"$f":"BN330*100/BM469","v":0},{"$f":"BO330*100/BO469","v":{"$error":"#DIV/0!"}},{"$f":"BP330*100/BO469","v":{"$error":"#DIV/0!"}},{"$f":"BQ330*100/BQ469","v":{"$error":"#DIV/0!"}},{"$f":"BR330*100/BQ469","v":{"$error":"#DIV/0!"}},{"$f":"BS330*100/BS469","v":7.1428571428571432},{"$f":"BT330*100/BS469","v":0},{"$f":"BU330*100/BU469","v":{"$error":"#DIV/0!"}},{"$f":"BV330*100/BU469","v":{"$error":"#DIV/0!"}},{"$f":"BW330*100/BW469","v":{"$error":"#DIV/0!"}},{"$f":"BX330*100/BW469","v":{"$error":"#DIV/0!"}},{"$f":"BY330*100/BY469","v":0},{"$f":"BZ330*100/BY469","v":0}]
[{"$f":"Equipamiento!$AM$499","v":"DIRECCIÓN"},null,null,null,{"$f":"Equipamiento!$AV$499*25/100/100","v":0},{"$f":"Equipamiento!$AU$499*25/100/100","v":2.4436090225563908E-2},{"$f":"IF(Equipamiento!$E$500=Equipamiento!$F$500, \"CUMPLE\", \"NO CUMPLE\")","v":"NO CUMPLE"},null,null,null,null,null,null,null,null,null,null,null,null,null,null,null,null,null,null,null,null,null,null,null,null,null,null,null,null,null,null,null,"DIRECCIÓN DE TALENTO HUMANO",null,null,null,"DIRECCIÓN DE TALENTO HUMANO",null,null,null,{"$f":"AU360*100/AU469","v":0},{"$f":"AV360*100/AU469","v":0},{"$f":"AW360*100/AW469","v":0},{"$f":"AX360*100/AW469","v":0},{"$f":"AY360*100/AY469","v":0},{"$f":"AZ360*100/AY469","v":0},{"$f":"BA360*100/BA469","v":{"$error":"#DIV/0!"}},{"$f":"BB360*100/BA469","v":{"$error":"#DIV/0!"}},{"$f":"BC360*100/BC469","v":0},{"$f":"BD360*100/BC469","v":0},{"$f":"BE360*100/BE469","v":0},{"$f":"BF360*100/BE469","v":0},{"$f":"BG360*100/BG469","v":{"$error":"#DIV/0!"}},{"$f":"BH360*100/BG469","v":{"$error":"#DIV/0!"}},{"$f":"BI360*100/BI469","v":{"$error":"#DIV/0!"}},{"$f":"BJ360*100/BI469","v":{"$error":"#DIV/0!"}},{"$f":"BK360*100/BK469","v":0},{"$f":"BL360*100/BK469","v":0},{"$f":"BM360*100/BM469","v":0},{"$f":"BN360*100/BM469","v":0},{"$f":"BO360*100/BO469","v":{"$error":"#DIV/0!"}},{"$f":"BP360*100/BO469","v":{"$error":"#DIV/0!"}},{"$f":"BQ360*100/BQ469","v":{"$error":"#DIV/0!"}},{"$f":"BR360*100/BQ469","v":{"$error":"#DIV/0!"}},{"$f":"BS360*100/BS469","v":0},{"$f":"BT360*100/BS469","v":0},{"$f":"BU360*100/BU469","v":{"$error":"#DIV/0!"}},{"$f":"BV360*100/BU469","v":{"$error":"#DIV/0!"}},{"$f":"BW360*100/BW469","v":{"$error":"#DIV/0!"}},{"$f":"BX360*100/BW469","v":{"$error":"#DIV/0!"}},{"$f":"BY360*100/BY469","v":0},{"$f":"BZ360*100/BY469","v":0}]
[{"$f":"Equipamiento!$AM$502","v":"ZONA DE APOYO DE LA DIRECCIÓN "},null,null,null,{"$f":"Equipamiento!$AV$502*25/100/100","v":0},{"$f":"Equipamiento!$AU$502*25/100/100","v":1.5037593984962405E-2},{"$f":"IF(Equipamiento!$E$501=Equipamiento!$F$501, \"CUMPLE\", \"NO CUMPLE\")","v":"NO CUMPLE"},null,null,null,null,null,null,null,null,null,null,null,null,null,null,null,null,null,null,null,null,null,null,null,null,null,null,null,null,null,null,null,"DIRECCIÓN ADMINISTRATIVO-FINANCIERA",null,null,null,"DIRECCIÓN ADMINISTRATIVO-FINANCIERA",null,null,null,{"$f":"AU370*100/AU469","v":0},{"$f":"AV370*100/AU469","v":0},{"$f":"AW370*100/AW469","v":0},{"$f":"AX370*100/AW469","v":0},{"$f":"AY370*100/AY469","v":0},{"$f":"AZ370*100/AY469","v":0},{"$f":"BA370*100/BA469","v":{"$error":"#DIV/0!"}},{"$f":"BB370*100/BA469","v":{"$error":"#DIV/0!"}},{"$f":"BC370*100/BC469","v":0},{"$f":"BD370*100/BC469","v":0},{"$f":"BE370*100/BE469","v":0},{"$f":"BF370*100/BE469","v":0},{"$f":"BG370*100/BG469","v":{"$error":"#DIV/0!"}},{"$f":"BH370*100/BG469","v":{"$error":"#DIV/0!"}},{"$f":"BI370*100/BI469","v":{"$error":"#DIV/0!"}},{"$f":"BJ370*100/BI469","v":{"$error":"#DIV/0!"}},{"$f":"BK370*100/BK469","v":0},{"$f":"BL370*100/BK469","v":0},{"$f":"BM370*100/BM469","v":0},{"$f":"BN370*100/BM469","v":0},{"$f":"BO370*100/BO469","v":{"$error":"#DIV/0!"}},{"$f":"BP370*100/BO469","v":{"$error":"#DIV/0!"}},{"$f":"BQ370*100/BQ469","v":{"$error":"#DIV/0!"}},{"$f":"BR370*100/BQ469","v":{"$error":"#DIV/0!"}},{"$f":"BS370*100/BS469","v":0},{"$f":"BT370*100/BS469","v":0},{"$f":"BU370*100/BU469","v":{"$error":"#DIV/0!"}},{"$f":"BV370*100/BU469","v":{"$error":"#DIV/0!"}},{"$f":"BW370*100/BW469","v":{"$error":"#DIV/0!"}},{"$f":"BX370*100/BW469","v":{"$error":"#DIV/0!"}},{"$f":"BY370*100/BY469","v":0},{"$f":"BZ370*100/BY469","v":0}]
[{"$f":"Equipamiento!$AM$503","v":"SERVICIOS GENERALES"},null,{"$f":"Equipamiento!$AV$503*25/100/100","v":0},null,null,{"$f":"Equipamiento!$AU$503*25/100/100","v":5.2631578947368425E-2},{"$f":"IF(Equipamiento!$C$502=Equipamiento!$F$502, \"CUMPLE\", \"NO CUMPLE\")","v":"NO CUMPLE"},null,null,null,null,null,null,null,null,null,null,null,null,null,null,null,null,null,null,null,null,null,null,null,null,null,null,null,null,null,null,null,"ZONA DE APOYO DE LA DIRECCIÓN ",null,null,null,"ZONA DE APOYO DE LA DIRECCIÓN ",null,null,null,{"$f":"AU379*100/AU469","v":6.0150375939849621},{"$f":"AV379*100/AU469","v":0},{"$f":"AW379*100/AW469","v":0},{"$f":"AX379*100/AW469","v":0},{"$f":"AY379*100/AY469","v":12.5},{"$f":"AZ379*100/AY469","v":0},{"$f":"BA379*100/BA469","v":{"$error":"#DIV/0!"}},{"$f":"BB379*100/BA469","v":{"$error":"#DIV/0!"}},{"$f":"BC379*100/BC469","v":0},{"$f":"BD379*100/BC469","v":0},{"$f":"BE379*100/BE469","v":0},{"$f":"BF379*100/BE469","v":0},{"$f":"BG379*100/BG469","v":{"$error":"#DIV/0!"}},{"$f":"BH379*100/BG469","v":{"$error":"#DIV/0!"}},{"$f":"BI379*100/BI469","v":{"$error":"#DIV/0!"}},{"$f":"BJ379*100/BI469","v":{"$error":"#DIV/0!"}},{"$f":"BK379*100/BK469","v":0},{"$f":"BL379*100/BK469","v":0},{"$f":"BM379*100/BM469","v":0},{"$f":"BN379*100/BM469","v":0},{"$f":"BO379*100/BO469","v":{"$error":"#DIV/0!"}},{"$f":"BP379*100/BO469","v":{"$error":"#DIV/0!"}},{"$f":"BQ379*100/BQ469","v":{"$error":"#DIV/0!"}},{"$f":"BR379*100/BQ469","v":{"$error":"#DIV/0!"}},{"$f":"BS379*100/BS469","v":0},{"$f":"BT379*100/BS469","v":0},{"$f":"BU379*100/BU469","v":{"$error":"#DIV/0!"}},{"$f":"BV379*100/BU469","v":{"$error":"#DIV/0!"}},{"$f":"BW379*100/BW469","v":{"$error":"#DIV/0!"}},{"$f":"BX379*100/BW469","v":{"$error":"#DIV/0!"}},{"$f":"BY379*100/BY469","v":0},{"$f":"BZ379*100/BY469","v":0}]
[{"$f":"Equipamiento!$AM$504","v":"BODEGA"},null,null,{"$f":"Equipamiento!$AV$504*25/100/100","v":0},null,{"$f":"Equipamiento!$AU$504*25/100/100","v":5.6390977443609028E-3},{"$f":"IF(Equipamiento!$D$503=Equipamiento!$F$503, \"CUMPLE\", \"NO CUMPLE\")","v":"NO CUMPLE"},null,null,null,null,null,null,null,null,null,null,null,null,null,null,null,null,null,null,null,null,null,null,null,null,null,null,null,null,null,null,null,"SERVICIOS GENERALES",null,null,null,"SERVICIOS GENERALES",null,null,null,{"$f":"AU405*100/AU469","v":21.05263157894737},{"$f":"AV405*100/AU469","v":0},{"$f":"AW405*100/AW469","v":0},{"$f":"AX405*100/AW469","v":0},{"$f":"AY405*100/AY469","v":0},{"$f":"AZ405*100/AY469","v":0},{"$f":"BA405*100/BA469","v":{"$error":"#DIV/0!"}},{"$f":"BB405*100/BA469","v":{"$error":"#DIV/0!"}},{"$f":"BC405*100/BC469","v":0},{"$f":"BD405*100/BC469","v":0},{"$f":"BE405*100/BE469","v":0},{"$f":"BF405*100/BE469","v":0},{"$f":"BG405*100/BG469","v":{"$error":"#DIV/0!"}},{"$f":"BH405*100/BG469","v":{"$error":"#DIV/0!"}},{"$f":"BI405*100/BI469","v":{"$error":"#DIV/0!"}},{"$f":"BJ405*100/BI469","v":{"$error":"#DIV/0!"}},{"$f":"BK405*100/BK469","v":0},{"$f":"BL405*100/BK469","v":0},{"$f":"BM405*100/BM469","v":0},{"$f":"BN405*100/BM469","v":0},{"$f":"BO405*100/BO469","v":{"$error":"#DIV/0!"}},{"$f":"BP405*100/BO469","v":{"$error":"#DIV/0!"}},{"$f":"BQ405*100/BQ469","v":{"$error":"#DIV/0!"}},{"$f":"BR405*100/BQ469","v":{"$error":"#DIV/0!"}},{"$f":"BS405*100/BS469","v":0},{"$f":"BT405*100/BS469","v":0},{"$f":"BU405*100/BU469","v":{"$error":"#DIV/0!"}},{"$f":"BV405*100/BU469","v":{"$error":"#DIV/0!"}},{"$f":"BW405*100/BW469","v":{"$error":"#DIV/0!"}},{"$f":"BX405*100/BW469","v":{"$error":"#DIV/0!"}},{"$f":"BY405*100/BY469","v":0},{"$f":"BZ405*100/BY469","v":0}]
[{"$f":"Equipamiento!$AM$506","v":"ÁREA DE ALMACENES"},null,null,null,{"$f":"Equipamiento!$AV$506*25/100/100","v":0},{"$f":"Equipamiento!$AU$506*25/100/100","v":5.6390977443609028E-3},{"$f":"IF(Equipamiento!$E$504=Equipamiento!$F$504, \"CUMPLE\", \"NO CUMPLE\")","v":"NO CUMPLE"},null,null,null,null,null,null,null,null,null,null,null,null,null,null,null,null,null,null,null,null,null,null,null,null,null,null,null,null,null,null,null,"BODEGA",null,null,null,"BODEGA",null,null,null,{"$f":"AU406*100/AU469","v":2.255639097744361},{"$f":"AV406*100/AU469","v":0},{"$f":"AW406*100/AW469","v":0},{"$f":"AX406*100/AW469","v":0},{"$f":"AY406*100/AY469","v":0},{"$f":"AZ406*100/AY469","v":0},{"$f":"BA406*100/BA469","v":{"$error":"#DIV/0!"}},{"$f":"BB406*100/BA469","v":{"$error":"#DIV/0!"}},{"$f":"BC406*100/BC469","v":0},{"$f":"BD406*100/BC469","v":0},{"$f":"BE406*100/BE469","v":0},{"$f":"BF406*100/BE469","v":0},{"$f":"BG406*100/BG469","v":{"$error":"#DIV/0!"}},{"$f":"BH406*100/BG469","v":{"$error":"#DIV/0!"}},{"$f":"BI406*100/BI469","v":{"$error":"#DIV/0!"}},{"$f":"BJ406*100/BI469","v":{"$error":"#DIV/0!"}},{"$f":"BK406*100/BK469","v":0},{"$f":"BL406*100/BK469","v":0},{"$f":"BM406*100/BM469","v":0},{"$f":"BN406*100/BM469","v":0},{"$f":"BO406*100/BO469","v":{"$error":"#DIV/0!"}},{"$f":"BP406*100/BO469","v":{"$error":"#DIV/0!"}},{"$f":"BQ406*100/BQ469","v":{"$error":"#DIV/0!"}},{"$f":"BR406*100/BQ469","v":{"$error":"#DIV/0!"}},{"$f":"BS406*100/BS469","v":0},{"$f":"BT406*100/BS469","v":0},{"$f":"BU406*100/BU469","v":{"$error":"#DIV/0!"}},{"$f":"BV406*100/BU469","v":{"$error":"#DIV/0!"}},{"$f":"BW406*100/BW469","v":{"$error":"#DIV/0!"}},{"$f":"BX406*100/BW469","v":{"$error":"#DIV/0!"}},{"$f":"BY406*100/BY469","v":0},{"$f":"BZ406*100/BY469","v":0}]
[{"$f":"Equipamiento!$AM$507","v":"LIMPIEZA"},null,null,{"$f":"Equipamiento!$AV$507*25/100/100","v":0},null,{"$f":"Equipamiento!$AU$507*25/100/100","v":1.8796992481203006E-3},{"$f":"IF(Equipamiento!$D$505=Equipamiento!$F$505, \"CUMPLE\", \"NO CUMPLE\")","v":"NO CUMPLE"},null,null,null,null,null,null,null,null,null,null,null,null,null,null,null,null,null,null,null,null,null,null,null,null,null,null,null,null,null,null,null,"ÁREA DE ACCESO DE RECEPCION",null,null,null,"ÁREA DE ACCESO DE RECEPCION",null,null,null,{"$f":"AU407*100/AU469","v":0},{"$f":"AV407*100/AU469","v":0},{"$f":"AW407*100/AW469","v":0},{"$f":"AX407*100/AW469","v":0},{"$f":"AY407*100/AY469","v":0},{"$f":"AZ407*100/AY469","v":0},{"$f":"BA407*100/BA469","v":{"$error":"#DIV/0!"}},{"$f":"BB407*100/BA469","v":{"$error":"#DIV/0!"}},{"$f":"BC407*100/BC469","v":0},{"$f":"BD407*100/BC469","v":0},{"$f":"BE407*100/BE469","v":0},{"$f":"BF407*100/BE469","v":0},{"$f":"BG407*100/BG469","v":{"$error":"#DIV/0!"}},{"$f":"BH407*100/BG469","v":{"$error":"#DIV/0!"}},{"$f":"BI407*100/BI469","v":{"$error":"#DIV/0!"}},{"$f":"BJ407*100/BI469","v":{"$error":"#DIV/0!"}},{"$f":"BK407*100/BK469","v":0},{"$f":"BL407*100/BK469","v":0},{"$f":"BM407*100/BM469","v":0},{"$f":"BN407*100/BM469","v":0},{"$f":"BO407*100/BO469","v":{"$error":"#DIV/0!"}},{"$f":"BP407*100/BO469","v":{"$error":"#DIV/0!"}},{"$f":"BQ407*100/BQ469","v":{"$error":"#DIV/0!"}},{"$f":"BR407*100/BQ469","v":{"$error":"#DIV/0!"}},{"$f":"BS407*100/BS469","v":0},{"$f":"BT407*100/BS469","v":0},{"$f":"BU407*100/BU469","v":{"$error":"#DIV/0!"}},{"$f":"BV407*100/BU469","v":{"$error":"#DIV/0!"}},{"$f":"BW407*100/BW469","v":{"$error":"#DIV/0!"}},{"$f":"BX407*100/BW469","v":{"$error":"#DIV/0!"}},{"$f":"BY407*100/BY469","v":0},{"$f":"BZ407*100/BY469","v":0}]
[{"$f":"Equipamiento!$AM$508","v":"ÁREA DE ALMACENES DE PRODUCTOS Y EQUIPOS DE LIMPIEZA"},null,null,null,{"$f":"Equipamiento!$AV$508*25/100/100","v":0},{"$f":"Equipamiento!$AU$508*25/100/100","v":1.8796992481203006E-3},{"$f":"IF(Equipamiento!$E$506=Equipamiento!$F$506, \"CUMPLE\", \"NO CUMPLE\")","v":"NO CUMPLE"},null,null,null,null,null,null,null,null,null,null,null,null,null,null,null,null,null,null,null,null,null,null,null,null,null,null,null,null,null,null,null,"ÁREA DE ALMACENES",null,null,null,"ÁREA DE ALMACENES",null,null,null,{"$f":"AU416*100/AU469","v":2.255639097744361},{"$f":"AV416*100/AU469","v":0},{"$f":"AW416*100/AW469","v":0},{"$f":"AX416*100/AW469","v":0},{"$f":"AY416*100/AY469","v":0},{"$f":"AZ416*100/AY469","v":0},{"$f":"BA416*100/BA469","v":{"$error":"#DIV/0!"}},{"$f":"BB416*100/BA469","v":{"$error":"#DIV/0!"}},{"$f":"BC416*100/BC469","v":0},{"$f":"BD416*100/BC469","v":0},{"$f":"BE416*100/BE469","v":0},{"$f":"BF416*100/BE469","v":0},{"$f":"BG416*100/BG469","v":{"$error":"#DIV/0!"}},{"$f":"BH416*100/BG469","v":{"$error":"#DIV/0!"}},{"$f":"BI416*100/BI469","v":{"$error":"#DIV/0!"}},{"$f":"BJ416*100/BI469","v":{"$error":"#DIV/0!"}},{"$f":"BK416*100/BK469","v":0},{"$f":"BL416*100/BK469","v":0},{"$f":"BM416*100/BM469","v":0},{"$f":"BN416*100/BM469","v":0},{"$f":"BO416*100/BO469","v":{"$error":"#DIV/0!"}},{"$f":"BP416*100/BO469","v":{"$error":"#DIV/0!"}},{"$f":"BQ416*100/BQ469","v":{"$error":"#DIV/0!"}},{"$f":"BR416*100/BQ469","v":{"$error":"#DIV/0!"}},{"$f":"BS416*100/BS469","v":0},{"$f":"BT416*100/BS469","v":0},{"$f":"BU416*100/BU469","v":{"$error":"#DIV/0!"}},{"$f":"BV416*100/BU469","v":{"$error":"#DIV/0!"}},{"$f":"BW416*100/BW469","v":{"$error":"#DIV/0!"}},{"$f":"BX416*100/BW469","v":{"$error":"#DIV/0!"}},{"$f":"BY416*100/BY469","v":0},{"$f":"BZ416*100/BY469","v":0}]
[{"$f":"Equipamiento!$AM$509","v":"VESTUARIOS GENERAL"},null,null,{"$f":"Equipamiento!$AV$509*25/100/100","v":0},null,{"$f":"Equipamiento!$AU$509*25/100/100","v":4.5112781954887222E-2},{"$f":"IF(Equipamiento!$D$507=Equipamiento!$F$507, \"CUMPLE\", \"NO CUMPLE\")","v":"NO CUMPLE"},null,null,null,null,null,null,null,null,null,null,null,null,null,null,null,null,null,null,null,null,null,null,null,null,null,null,null,null,null,null,null,"LIMPIEZA",null,null,null,"LIMPIEZA",null,null,null,{"$f":"AU421*100/AU469","v":0.75187969924812026},{"$f":"AV421*100/AU469","v":0},{"$f":"AW421*100/AW469","v":0},{"$f":"AX421*100/AW469","v":0},{"$f":"AY421*100/AY469","v":0},{"$f":"AZ421*100/AY469","v":0},{"$f":"BA421*100/BA469","v":{"$error":"#DIV/0!"}},{"$f":"BB421*100/BA469","v":{"$error":"#DIV/0!"}},{"$f":"BC421*100/BC469","v":0},{"$f":"BD421*100/BC469","v":0},{"$f":"BE421*100/BE469","v":0},{"$f":"BF421*100/BE469","v":0},{"$f":"BG421*100/BG469","v":{"$error":"#DIV/0!"}},{"$f":"BH421*100/BG469","v":{"$error":"#DIV/0!"}},{"$f":"BI421*100/BI469","v":{"$error":"#DIV/0!"}},{"$f":"BJ421*100/BI469","v":{"$error":"#DIV/0!"}},{"$f":"BK421*100/BK469","v":0},{"$f":"BL421*100/BK469","v":0},{"$f":"BM421*100/BM469","v":0},{"$f":"BN421*100/BM469","v":0},{"$f":"BO421*100/BO469","v":{"$error":"#DIV/0!"}},{"$f":"BP421*100/BO469","v":{"$error":"#DIV/0!"}},{"$f":"BQ421*100/BQ469","v":{"$error":"#DIV/0!"}},{"$f":"BR421*100/BQ469","v":{"$error":"#DIV/0!"}},{"$f":"BS421*100/BS469","v":0},{"$f":"BT421*100/BS469","v":0},{"$f":"BU421*100/BU469","v":{"$error":"#DIV/0!"}},{"$f":"BV421*100/BU469","v":{"$error":"#DIV/0!"}},{"$f":"BW421*100/BW469","v":{"$error":"#DIV/0!"}},{"$f":"BX421*100/BW469","v":{"$error":"#DIV/0!"}},{"$f":"BY421*100/BY469","v":0},{"$f":"BZ421*100/BY469","v":0}]
[{"$f":"Equipamiento!$AM$510","v":"ÁREA DE PERSONAL"},null,null,null,{"$f":"Equipamiento!$AV$510*25/100/100","v":0},{"$f":"Equipamiento!$AU$510*25/100/100","v":4.5112781954887222E-2},{"$f":"IF(Equipamiento!$E$508=Equipamiento!$F$508, \"CUMPLE\", \"NO CUMPLE\")","v":"NO CUMPLE"},null,null,null,null,null,null,null,null,null,null,null,null,null,null,null,null,null,null,null,null,null,null,null,null,null,null,null,null,null,null,null,"ÁREA DE ALMACENES DE PRODUCTOS Y EQUIPOS DE LIMPIEZA",null,null,null,"ÁREA DE ALMACENES DE PRODUCTOS Y EQUIPOS DE LIMPIEZA",null,null,null,{"$f":"AU422*100/AU469","v":0.75187969924812026},{"$f":"AV422*100/AU469","v":0},{"$f":"AW422*100/AW469","v":0},{"$f":"AX422*100/AW469","v":0},{"$f":"AY422*100/AY469","v":0},{"$f":"AZ422*100/AY469","v":0},{"$f":"BA422*100/BA469","v":{"$error":"#DIV/0!"}},{"$f":"BB422*100/BA469","v":{"$error":"#DIV/0!"}},{"$f":"BC422*100/BC469","v":0},{"$f":"BD422*100/BC469","v":0},{"$f":"BE422*100/BE469","v":0},{"$f":"BF422*100/BE469","v":0},{"$f":"BG422*100/BG469","v":{"$error":"#DIV/0!"}},{"$f":"BH422*100/BG469","v":{"$error":"#DIV/0!"}},{"$f":"BI422*100/BI469","v":{"$error":"#DIV/0!"}},{"$f":"BJ422*100/BI469","v":{"$error":"#DIV/0!"}},{"$f":"BK422*100/BK469","v":0},{"$f":"BL422*100/BK469","v":0},{"$f":"BM422*100/BM469","v":0},{"$f":"BN422*100/BM469","v":0},{"$f":"BO422*100/BO469","v":{"$error":"#DIV/0!"}},{"$f":"BP422*100/BO469","v":{"$error":"#DIV/0!"}},{"$f":"BQ422*100/BQ469","v":{"$error":"#DIV/0!"}},{"$f":"BR422*100/BQ469","v":{"$error":"#DIV/0!"}},{"$f":"BS422*100/BS469","v":0},{"$f":"BT422*100/BS469","v":0},{"$f":"BU422*100/BU469","v":{"$error":"#DIV/0!"}},{"$f":"BV422*100/BU469","v":{"$error":"#DIV/0!"}},{"$f":"BW422*100/BW469","v":{"$error":"#DIV/0!"}},{"$f":"BX422*100/BW469","v":{"$error":"#DIV/0!"}},{"$f":"BY422*100/BY469","v":0},{"$f":"BZ422*100/BY469","v":0}]
[{"$f":"Equipamiento!$AM$513","v":"ALMACENAMIENTO FINAL DE DESECHOS"},null,null,{"$f":"Equipamiento!$AV$513*25/100/100","v":0},null,{"$f":"Equipamiento!$AU$513*25/100/100","v":0},{"$f":"IF(Equipamiento!$D$509=Equipamiento!$F$509, \"CUMPLE\", \"NO CUMPLE\")","v":"CUMPLE"},null,null,null,null,null,null,null,null,null,null,null,null,null,null,null,null,null,null,null,null,null,null,null,null,null,null,null,null,null,null,null,"VESTUARIOS GENERAL",null,null,null,"VESTUARIOS GENERAL",null,null,null,{"$f":"AU425*100/AU469","v":18.045112781954888},{"$f":"AV425*100/AU469","v":0},{"$f":"AW425*100/AW469","v":0},{"$f":"AX425*100/AW469","v":0},{"$f":"AY425*100/AY469","v":0},{"$f":"AZ425*100/AY469","v":0},{"$f":"BA425*100/BA469","v":{"$error":"#DIV/0!"}},{"$f":"BB425*100/BA469","v":{"$error":"#DIV/0!"}},{"$f":"BC425*100/BC469","v":0},{"$f":"BD425*100/BC469","v":0},{"$f":"BE425*100/BE469","v":0},{"$f":"BF425*100/BE469","v":0},{"$f":"BG425*100/BG469","v":{"$error":"#DIV/0!"}},{"$f":"BH425*100/BG469","v":{"$error":"#DIV/0!"}},{"$f":"BI425*100/BI469","v":{"$error":"#DIV/0!"}},{"$f":"BJ425*100/BI469","v":{"$error":"#DIV/0!"}},{"$f":"BK425*100/BK469","v":0},{"$f":"BL425*100/BK469","v":0},{"$f":"BM425*100/BM469","v":0},{"$f":"BN425*100/BM469","v":0},{"$f":"BO425*100/BO469","v":{"$error":"#DIV/0!"}},{"$f":"BP425*100/BO469","v":{"$error":"#DIV/0!"}},{"$f":"BQ425*100/BQ469","v":{"$error":"#DIV/0!"}},{"$f":"BR425*100/BQ469","v":{"$error":"#DIV/0!"}},{"$f":"BS425*100/BS469","v":0},{"$f":"BT425*100/BS469","v":0},{"$f":"BU425*100/BU469","v":{"$error":"#DIV/0!"}},{"$f":"BV425*100/BU469","v":{"$error":"#DIV/0!"}},{"$f":"BW425*100/BW469","v":{"$error":"#DIV/0!"}},{"$f":"BX425*100/BW469","v":{"$error":"#DIV/0!"}},{"$f":"BY425*100/BY469","v":0},{"$f":"BZ425*100/BY469","v":0}]
[{"$f":"Equipamiento!$AM$514","v":"ÁREA TÉCNICA"},null,null,null,{"$f":"Equipamiento!$AV$514*25/100/100","v":0},{"$f":"Equipamiento!$AU$514*25/100/100","v":0},{"$f":"IF(Equipamiento!$E$510=Equipamiento!$F$510, \"CUMPLE\", \"NO CUMPLE\")","v":"CUMPLE"},null,null,null,null,null,null,null,null,null,null,null,null,null,null,null,null,null,null,null,null,null,null,null,null,null,null,null,null,null,null,null,"ÁREA DE PERSONAL",null,null,null,"ÁREA DE PERSONAL",null,null,null,{"$f":"AU426*100/AU469","v":18.045112781954888},{"$f":"AV426*100/AU469","v":0},{"$f":"AW426*100/AW469","v":0},{"$f":"AX426*100/AW469","v":0},{"$f":"AY426*100/AY469","v":0},{"$f":"AZ426*100/AY469","v":0},{"$f":"BA426*100/BA469","v":{"$error":"#DIV/0!"}},{"$f":"BB426*100/BA469","v":{"$error":"#DIV/0!"}},{"$f":"BC426*100/BC469","v":0},{"$f":"BD426*100/BC469","v":0},{"$f":"BE426*100/BE469","v":0},{"$f":"BF426*100/BE469","v":0},{"$f":"BG426*100/BG469","v":{"$error":"#DIV/0!"}},{"$f":"BH426*100/BG469","v":{"$error":"#DIV/0!"}},{"$f":"BI426*100/BI469","v":{"$error":"#DIV/0!"}},{"$f":"BJ426*100/BI469","v":{"$error":"#DIV/0!"}},{"$f":"BK426*100/BK469","v":0},{"$f":"BL426*100/BK469","v":0},{"$f":"BM426*100/BM469","v":0},{"$f":"BN426*100/BM469","v":0},{"$f":"BO426*100/BO469","v":{"$error":"#DIV/0!"}},{"$f":"BP426*100/BO469","v":{"$error":"#DIV/0!"}},{"$f":"BQ426*100/BQ469","v":{"$error":"#DIV/0!"}},{"$f":"BR426*100/BQ469","v":{"$error":"#DIV/0!"}},{"$f":"BS426*100/BS469","v":0},{"$f":"BT426*100/BS469","v":0},{"$f":"BU426*100/BU469","v":{"$error":"#DIV/0!"}},{"$f":"BV426*100/BU469","v":{"$error":"#DIV/0!"}},{"$f":"BW426*100/BW469","v":{"$error":"#DIV/0!"}},{"$f":"BX426*100/BW469","v":{"$error":"#DIV/0!"}},{"$f":"BY426*100/BY469","v":0},{"$f":"BZ426*100/BY469","v":0}]
["TOTAL REQUERIDO:",null,null,null,null,0.25,{"$f":"SUM(Equipamiento!$C$471                                                                      : Equipamiento!$C$510)","v":0},null,null,null,null,null,null,null,null,null,null,null,null,null,null,null,null,null,null,null,null,null,null,null,null,null,null,null,null,null,null,null,"MANTENIMIENTO",null,null,null,"MANTENIMIENTO",null,null,null,{"$f":"AU453*100/AU469","v":0},{"$f":"AV453*100/AU469","v":0},{"$f":"AW453*100/AW469","v":0},{"$f":"AX453*100/AW469","v":0},{"$f":"AY453*100/AY469","v":0},{"$f":"AZ453*100/AY469","v":0},{"$f":"BA453*100/BA469","v":{"$error":"#DIV/0!"}},{"$f":"BB453*100/BA469","v":{"$error":"#DIV/0!"}},{"$f":"BC453*100/BC469","v":0},{"$f":"BD453*100/BC469","v":0},{"$f":"BE453*100/BE469","v":0},{"$f":"BF453*100/BE469","v":0},{"$f":"BG453*100/BG469","v":{"$error":"#DIV/0!"}},{"$f":"BH453*100/BG469","v":{"$error":"#DIV/0!"}},{"$f":"BI453*100/BI469","v":{"$error":"#DIV/0!"}},{"$f":"BJ453*100/BI469","v":{"$error":"#DIV/0!"}},{"$f":"BK453*100/BK469","v":0},{"$f":"BL453*100/BK469","v":0},{"$f":"BM453*100/BM469","v":0},{"$f":"BN453*100/BM469","v":0},{"$f":"BO453*100/BO469","v":{"$error":"#DIV/0!"}},{"$f":"BP453*100/BO469","v":{"$error":"#DIV/0!"}},{"$f":"BQ453*100/BQ469","v":{"$error":"#DIV/0!"}},{"$f":"BR453*100/BQ469","v":{"$error":"#DIV/0!"}},{"$f":"BS453*100/BS469","v":0},{"$f":"BT453*100/BS469","v":0},{"$f":"BU453*100/BU469","v":{"$error":"#DIV/0!"}},{"$f":"BV453*100/BU469","v":{"$error":"#DIV/0!"}},{"$f":"BW453*100/BW469","v":{"$error":"#DIV/0!"}},{"$f":"BX453*100/BW469","v":{"$error":"#DIV/0!"}},{"$f":"BY453*100/BY469","v":0},{"$f":"BZ453*100/BY469","v":0}]
["TOTAL OPCIONAL:",null,null,null,null,0.25,{"$f":"Equipamiento!$AX$469*25/Equipamiento!$AW$469/100","v":0},null,null,null,null,null,null,null,null,null,null,null,null,null,null,null,null,null,null,null,null,null,null,null,null,null,null,null,null,null,null,null,"ÁREA TÉCNICA",null,null,null,"ÁREA TÉCNICA",null,null,null,{"$f":"AU454*100/AU469","v":0},{"$f":"AV454*100/AU469","v":0},{"$f":"AW454*100/AW469","v":0},{"$f":"AX454*100/AW469","v":0},{"$f":"AY454*100/AY469","v":0},{"$f":"AZ454*100/AY469","v":0},{"$f":"BA454*100/BA469","v":{"$error":"#DIV/0!"}},{"$f":"BB454*100/BA469","v":{"$error":"#DIV/0!"}},{"$f":"BC454*100/BC469","v":0},{"$f":"BD454*100/BC469","v":0},{"$f":"BE454*100/BE469","v":0},{"$f":"BF454*100/BE469","v":0},{"$f":"BG454*100/BG469","v":{"$error":"#DIV/0!"}},{"$f":"BH454*100/BG469","v":{"$error":"#DIV/0!"}},{"$f":"BI454*100/BI469","v":{"$error":"#DIV/0!"}},{"$f":"BJ454*100/BI469","v":{"$error":"#DIV/0!"}},{"$f":"BK454*100/BK469","v":0},{"$f":"BL454*100/BK469","v":0},{"$f":"BM454*100/BM469","v":0},{"$f":"BN454*100/BM469","v":0},{"$f":"BO454*100/BO469","v":{"$error":"#DIV/0!"}},{"$f":"BP454*100/BO469","v":{"$error":"#DIV/0!"}},{"$f":"BQ454*100/BQ469","v":{"$error":"#DIV/0!"}},{"$f":"BR454*100/BQ469","v":{"$error":"#DIV/0!"}},{"$f":"BS454*100/BS469","v":0},{"$f":"BT454*100/BS469","v":0},{"$f":"BU454*100/BU469","v":{"$error":"#DIV/0!"}},{"$f":"BV454*100/BU469","v":{"$error":"#DIV/0!"}},{"$f":"BW454*100/BW469","v":{"$error":"#DIV/0!"}},{"$f":"BX454*100/BW469","v":{"$error":"#DIV/0!"}},{"$f":"BY454*100/BY469","v":0},{"$f":"BZ454*100/BY469","v":0}]
["TOTAL DESEABLE:",null,null,null,null,0.25,{"$f":"Equipamiento!$AZ$469*25/Equipamiento!$AY$469/100","v":0},null,null,null,null,null,null,null,null,null,null,null,null,null,null,null,null,null,null,null,null,null,null,null,null,null,null,null,null,null,null,null,"ALMACENAMIENTO FINAL DE DESECHOS",null,null,null,"ALMACENAMIENTO FINAL DE DESECHOS",null,null,null,{"$f":"AU461*100/AU469","v":0},{"$f":"AV461*100/AU469","v":0},{"$f":"AW461*100/AW469","v":0},{"$f":"AX461*100/AW469","v":0},{"$f":"AY461*100/AY469","v":0},{"$f":"AZ461*100/AY469","v":0},{"$f":"BA461*100/BA469","v":{"$error":"#DIV/0!"}},{"$f":"BB461*100/BA469","v":{"$error":"#DIV/0!"}},{"$f":"BC461*100/BC469","v":0},{"$f":"BD461*100/BC469","v":0},{"$f":"BE461*100/BE469","v":0},{"$f":"BF461*100/BE469","v":0},{"$f":"BG461*100/BG469","v":{"$error":"#DIV/0!"}},{"$f":"BH461*100/BG469","v":{"$error":"#DIV/0!"}},{"$f":"BI461*100/BI469","v":{"$error":"#DIV/0!"}},{"$f":"BJ461*100/BI469","v":{"$error":"#DIV/0!"}},{"$f":"BK461*100/BK469","v":0},{"$f":"BL461*100/BK469","v":0},{"$f":"BM461*100/BM469","v":0},{"$f":"BN461*100/BM469","v":0},{"$f":"BO461*100/BO469","v":{"$error":"#DIV/0!"}},{"$f":"BP461*100/BO469","v":{"$error":"#DIV/0!"}},{"$f":"BQ461*100/BQ469","v":{"$error":"#DIV/0!"}},{"$f":"BR461*100/BQ469","v":{"$error":"#DIV/0!"}},{"$f":"BS461*100/BS469","v":0},{"$f":"BT461*100/BS469","v":0},{"$f":"BU461*100/BU469","v":{"$error":"#DIV/0!"}},{"$f":"BV461*100/BU469","v":{"$error":"#DIV/0!"}},{"$f":"BW461*100/BW469","v":{"$error":"#DIV/0!"}},{"$f":"BX461*100/BW469","v":{"$error":"#DIV/0!"}},{"$f":"BY461*100/BY469","v":0},{"$f":"BZ461*100/BY469","v":0}]
["TOTAL CONDICIÓN:",null,null,null,null,0.25,{"$f":"25/100","v":0.25},null,null,null,null,null,null,null,null,null,null,null,null,null,null,null,null,null,null,null,null,null,null,null,null,null,null,null,null,null,null,null,"ÁREA TÉCNICA",null,null,null,"ÁREA TÉCNICA",null,null,null,{"$f":"AU462*100/AU469","v":0},{"$f":"AV462*100/AU469","v":0},{"$f":"AW462*100/AW469","v":0},{"$f":"AX462*100/AW469","v":0},{"$f":"AY462*100/AY469","v":0},{"$f":"AZ462*100/AY469","v":0},{"$f":"BA462*100/BA469","v":{"$error":"#DIV/0!"}},{"$f":"BB462*100/BA469","v":{"$error":"#DIV/0!"}},{"$f":"BC462*100/BC469","v":0},{"$f":"BD462*100/BC469","v":0},{"$f":"BE462*100/BE469","v":0},{"$f":"BF462*100/BE469","v":0},{"$f":"BG462*100/BG469","v":{"$error":"#DIV/0!"}},{"$f":"BH462*100/BG469","v":{"$error":"#DIV/0!"}},{"$f":"BI462*100/BI469","v":{"$error":"#DIV/0!"}},{"$f":"BJ462*100/BI469","v":{"$error":"#DIV/0!"}},{"$f":"BK462*100/BK469","v":0},{"$f":"BL462*100/BK469","v":0},{"$f":"BM462*100/BM469","v":0},{"$f":"BN462*100/BM469","v":0},{"$f":"BO462*100/BO469","v":{"$error":"#DIV/0!"}},{"$f":"BP462*100/BO469","v":{"$error":"#DIV/0!"}},{"$f":"BQ462*100/BQ469","v":{"$error":"#DIV/0!"}},{"$f":"BR462*100/BQ469","v":{"$error":"#DIV/0!"}},{"$f":"BS462*100/BS469","v":0},{"$f":"BT462*100/BS469","v":0},{"$f":"BU462*100/BU469","v":{"$error":"#DIV/0!"}},{"$f":"BV462*100/BU469","v":{"$error":"#DIV/0!"}},{"$f":"BW462*100/BW469","v":{"$error":"#DIV/0!"}},{"$f":"BX462*100/BW469","v":{"$error":"#DIV/0!"}},{"$f":"BY462*100/BY469","v":0},{"$f":"BZ462*100/BY469","v":0}]
["MOBILIARIO MÉDICO:",null,"% Obtenido:","% Obtenido:","% Obtenido:","% A Cumplir:","% Final:"]
[{"$f":"Equipamiento!$AM$470","v":"SERVICIO DE ADMISIÓN Y CONSULTA EXTERNA"},null,{"$f":"Equipamiento!$BD$470*25/100/100","v":0},null,null,{"$f":"Equipamiento!$BC$470*25/100/100","v":4.1666666666666671E-2},{"$f":"IF(Equipamiento!$C$516=Equipamiento!$F$516, \"CUMPLE\", \"NO CUMPLE\")","v":"NO CUMPLE"}]
[{"$f":"Equipamiento!$AM$471","v":"CONSULTA EXTERNA"},null,null,{"$f":"Equipamiento!$BD$471*25/100/100","v":0},null,{"$f":"Equipamiento!$BC$471*25/100/100","v":4.1666666666666671E-2},{"$f":"IF(Equipamiento!$D$517=Equipamiento!$F$517, \"CUMPLE\", \"NO CUMPLE\")","v":"NO CUMPLE"}]
[{"$f":"Equipamiento!$AM$473","v":"AREA DE PACIENTE"},null,null,null,{"$f":"Equipamiento!$BD$473*25/100/100","v":0},{"$f":"Equipamiento!$BC$473*25/100/100","v":4.1666666666666671E-2},{"$f":"IF(Equipamiento!$E$518=Equipamiento!$F$518, \"CUMPLE\", \"NO CUMPLE\")","v":"NO CUMPLE"}]
[{"$f":"Equipamiento!$AM$474","v":"SERVICIO DE DIÁLISIS PERITONEAL"},null,{"$f":"Equipamiento!$BD$474*25/100/100","v":0},null,null,{"$f":"Equipamiento!$BC$474*25/100/100","v":0},{"$f":"IF(Equipamiento!$C$519=Equipamiento!$F$519, \"CUMPLE\", \"NO CUMPLE\")","v":"CUMPLE"}]
[{"$f":"Equipamiento!$AM$475","v":"ÁREA DE PROCEDIMIENTO  DE DIÁLISIS PERITONEAL"},null,null,{"$f":"Equipamiento!$BD$475*25/100/100","v":0},null,{"$f":"Equipamiento!$BC$475*25/100/100","v":0},{"$f":"IF(Equipamiento!$D$520=Equipamiento!$F$520, \"CUMPLE\", \"NO CUMPLE\")","v":"CUMPLE"}]
[{"$f":"Equipamiento!$AM$476","v":"ÁREA DE TRATAMIENTO"},null,null,null,{"$f":"Equipamiento!$BD$476*25/100/100","v":0},{"$f":"Equipamiento!$BC$476*25/100/100","v":0},{"$f":"IF(Equipamiento!$E$521=Equipamiento!$F$521, \"CUMPLE\", \"NO CUMPLE\")","v":"CUMPLE"}]
[{"$f":"Equipamiento!$AM$479","v":"SERVICIO DE DIÁLISIS PERITONEAL"},null,{"$f":"Equipamiento!$BD$479*25/100/100","v":0},null,null,{"$f":"Equipamiento!$BC$479*25/100/100","v":8.3333333333333343E-2},{"$f":"IF(Equipamiento!$C$522=Equipamiento!$F$522, \"CUMPLE\", \"NO CUMPLE\")","v":"NO CUMPLE"}]
[{"$f":"Equipamiento!$AM$480","v":"ÁREA DE TRATAMIENTO DE DIÁLISIS PERITONEAL"},null,null,{"$f":"Equipamiento!$BD$480*25/100/100","v":0},null,{"$f":"Equipamiento!$BC$480*25/100/100","v":8.3333333333333343E-2},{"$f":"IF(Equipamiento!$D$523=Equipamiento!$F$523, \"CUMPLE\", \"NO CUMPLE\")","v":"NO CUMPLE"}]
[{"$f":"Equipamiento!$AM$481","v":"ÁREA DE TRATAMIENTO "},null,null,null,{"$f":"Equipamiento!$BD$481*25/100/100","v":0},{"$f":"Equipamiento!$BC$481*25/100/100","v":8.3333333333333343E-2},{"$f":"IF(Equipamiento!$E$524=Equipamiento!$F$524, \"CUMPLE\", \"NO CUMPLE\")","v":"NO CUMPLE"}]
[{"$f":"AM483","v":"SERVICIO DE DIAGNÓSTICO"},null,{"$f":"Equipamiento!$BD$483*25/100/100","v":0},null,null,{"$f":"Equipamiento!$BC$483*25/100/100","v":0},{"$f":"IF(Equipamiento!$C$525=Equipamiento!$F$525, \"CUMPLE\", \"NO CUMPLE\")","v":"CUMPLE"}]
[{"$f":"AM484","v":"LABORATORIO - PUESTO DE TOMA DE MUESTRAS"},null,null,{"$f":"Equipamiento!$BD$484*25/100/100","v":0},null,{"$f":"Equipamiento!$BC$484*25/100/100","v":0},{"$f":"IF(Equipamiento!$D$526=Equipamiento!$F$526, \"CUMPLE\", \"NO CUMPLE\")","v":"CUMPLE"}]
[{"$f":"AM485","v":"ÁREA DE TOMA DE MUESTRAS"},null,null,null,{"$f":"Equipamiento!$BD$485*25/100/100","v":0},{"$f":"Equipamiento!$BC$485*25/100/100","v":0},{"$f":"IF(Equipamiento!$E$527=Equipamiento!$F$527, \"CUMPLE\", \"NO CUMPLE\")","v":"CUMPLE"}]
[{"$f":"AM486","v":"ÁREA DE PROCESAMIENTO"},null,null,null,{"$f":"Equipamiento!$BD$486*25/100/100","v":0},{"$f":"Equipamiento!$BC$486*25/100/100","v":0},{"$f":"IF(Equipamiento!$E$528=Equipamiento!$F$528, \"CUMPLE\", \"NO CUMPLE\")","v":"CUMPLE"}]
[{"$f":"AM497","v":"SERVICIO DE ADMINISTRACIÓN"},null,{"$f":"Equipamiento!$BD$497*25/100/100","v":0},null,null,{"$f":"Equipamiento!$BC$497*25/100/100","v":0.125},{"$f":"IF(Equipamiento!$C$529=Equipamiento!$F$529, \"CUMPLE\", \"NO CUMPLE\")","v":"NO CUMPLE"}]
[{"$f":"AM498","v":"DIRECCIÓN Y GESTIÓN ADMINISTRATIVA"},null,null,{"$f":"Equipamiento!$BD$498*25/100/100","v":0},null,{"$f":"Equipamiento!$BC$498*25/100/100","v":0.125},{"$f":"IF(Equipamiento!$D$530=Equipamiento!$F$530, \"CUMPLE\", \"NO CUMPLE\")","v":"NO CUMPLE"},null,null,null,null," "]
[{"$f":"AM499","v":"DIRECCIÓN"},null,null,null,{"$f":"Equipamiento!$BD$499*25/100/100","v":0},{"$f":"Equipamiento!$BC$499*25/100/100","v":0.125},{"$f":"IF(Equipamiento!$E$531=Equipamiento!$F$531, \"CUMPLE\", \"NO CUMPLE\")","v":"NO CUMPLE"}]
["TOTAL REQUERIDO:",null,null,null,null,0.25,{"$f":"SUM(Equipamiento!$C$516                                                                  : Equipamiento!$C$531)","v":0}]
["TOTAL OPCIONAL:",null,null,null,null,0.25,{"$f":"Equipamiento!$BF$469*25/Equipamiento!$BE$469/100","v":0}]
["TOTAL DESEABLE:",null,null,null,null,0.25,{"$f":"25/100","v":0.25}]
["TOTAL CONDICIÓN:",null,null,null,null,0.25,{"$f":"25/100","v":0.25}]
["EQUIPO GENERAL:",null,"% Obtenido:","% Obtenido:","% Obtenido:","% A Cumplir:","% Final:"]
[{"$f":"Equipamiento!$AM$470","v":"SERVICIO DE ADMISIÓN Y CONSULTA EXTERNA"},null,{"$f":"Equipamiento!$BL$470*25/100/100","v":0},null,null,{"$f":"Equipamiento!$BK$470*25/100/100","v":0.125},{"$f":"IF(Equipamiento!$C$537=Equipamiento!$F$537, \"CUMPLE\", \"NO CUMPLE\")","v":"NO CUMPLE"}]
[{"$f":"Equipamiento!$AM$471","v":"CONSULTA EXTERNA"},null,null,{"$f":"Equipamiento!$BL$471*25/100/100","v":0},null,{"$f":"Equipamiento!$BK$471*25/100/100","v":0.125},{"$f":"IF(Equipamiento!$D$538=Equipamiento!$F$538, \"CUMPLE\", \"NO CUMPLE\")","v":"NO CUMPLE"}]
[{"$f":"Equipamiento!$AM$472","v":"ADMISIÓN Y CONTROL"},null,null,null,{"$f":"Equipamiento!$BL$472*25/100/100","v":0},{"$f":"Equipamiento!$BK$472*25/100/100","v":6.25E-2},{"$f":"IF(Equipamiento!$E$539=Equipamiento!$F$539, \"CUMPLE\", \"NO CUMPLE\")","v":"NO CUMPLE"}]
[{"$f":"Equipamiento!$AM$473","v":"AREA DE PACIENTE"},null,null,null,{"$f":"Equipamiento!$BL$473*25/100/100","v":0},{"$f":"Equipamiento!$BK$473*25/100/100","v":6.25E-2},{"$f":"IF(Equipamiento!$E$540=Equipamiento!$F$540, \"CUMPLE\", \"NO CUMPLE\")","v":"NO CUMPLE"}]
[{"$f":"Equipamiento!$AM$474","v":"SERVICIO DE DIÁLISIS PERITONEAL"},null,{"$f":"Equipamiento!$BL$474*25/100/100","v":0},null,null,{"$f":"Equipamiento!$BK$474*25/100/100","v":2.0833333333333336E-2},{"$f":"IF(Equipamiento!$C$541=Equipamiento!$F$541, \"CUMPLE\", \"NO CUMPLE\")","v":"NO CUMPLE"}]
[{"$f":"Equipamiento!$AM$477","v":"ÁREA DE APOYO Y APROVISONAMIENTO"},null,null,{"$f":"Equipamiento!$BL$477*25/100/100","v":0},null,{"$f":"Equipamiento!$BK$477*25/100/100","v":2.0833333333333336E-2},{"$f":"IF(Equipamiento!$D$542=Equipamiento!$F$542, \"CUMPLE\", \"NO CUMPLE\")","v":"NO CUMPLE"}]
[{"$f":"Equipamiento!$AM$478","v":"ÁREA PACIENTE"},null,null,null,{"$f":"Equipamiento!$BL$478*25/100/100","v":0},{"$f":"Equipamiento!$BK$478*25/100/100","v":2.0833333333333336E-2},{"$f":"IF(Equipamiento!$E$543=Equipamiento!$F$543, \"CUMPLE\", \"NO CUMPLE\")","v":"NO CUMPLE"}]
[{"$f":"AM479","v":"SERVICIO DE DIÁLISIS PERITONEAL"},null,{"$f":"Equipamiento!$BL$479*25/100/100","v":0},null,null,{"$f":"Equipamiento!$BK$479*25/100/100","v":2.0833333333333336E-2},{"$f":"IF(Equipamiento!$C$544=Equipamiento!$F$544, \"CUMPLE\", \"NO CUMPLE\")","v":"NO CUMPLE"}]
[{"$f":"Equipamiento!$AM$480","v":"ÁREA DE TRATAMIENTO DE DIÁLISIS PERITONEAL"},null,null,{"$f":"Equipamiento!$BL$480*25/100/100","v":0},null,{"$f":"Equipamiento!$BK$480*25/100/100","v":2.0833333333333336E-2},{"$f":"IF(Equipamiento!$D$545=Equipamiento!$F$545, \"CUMPLE\", \"NO CUMPLE\")","v":"NO CUMPLE"}]
[{"$f":"Equipamiento!$AM$481","v":"ÁREA DE TRATAMIENTO "},null,null,null,{"$f":"Equipamiento!$BL$481*25/100/100","v":0},{"$f":"Equipamiento!$BK$481*25/100/100","v":2.0833333333333336E-2},{"$f":"IF(Equipamiento!$E$546=Equipamiento!$F$546, \"CUMPLE\", \"NO CUMPLE\")","v":"NO CUMPLE"}]
[{"$f":"AM483","v":"SERVICIO DE DIAGNÓSTICO"},null,{"$f":"Equipamiento!$BL$483*25/100/100","v":0},null,null,{"$f":"Equipamiento!$BK$483*25/100/100","v":0},{"$f":"IF(Equipamiento!$C$547=Equipamiento!$F$547, \"CUMPLE\", \"NO CUMPLE\")","v":"CUMPLE"}]
[{"$f":"Equipamiento!$AM$484","v":"LABORATORIO - PUESTO DE TOMA DE MUESTRAS"},null,null,{"$f":"Equipamiento!$BL$484*25/100/100","v":0},null,{"$f":"Equipamiento!$BK$484*25/100/100","v":0},{"$f":"IF(Equipamiento!$D$548=Equipamiento!$F$548, \"CUMPLE\", \"NO CUMPLE\")","v":"CUMPLE"}]
[{"$f":"Equipamiento!$AM$485","v":"ÁREA DE TOMA DE MUESTRAS"},null,null,null,{"$f":"Equipamiento!$BL$485*25/100/100","v":0},{"$f":"Equipamiento!$BK$485*25/100/100","v":0},{"$f":"IF(Equipamiento!$E$549=Equipamiento!$F$549, \"CUMPLE\", \"NO CUMPLE\")","v":"CUMPLE"}]
[{"$f":"Equipamiento!$AM$487","v":"SERVICIOS DE APOYO"},null,{"$f":"Equipamiento!$BL$487*25/100/100","v":0},null,null,{"$f":"Equipamiento!$BK$487*25/100/100","v":6.25E-2},{"$f":"IF(Equipamiento!$C$550=Equipamiento!$F$550, \"CUMPLE\", \"NO CUMPLE\")","v":"NO CUMPLE"}]
[{"$f":"Equipamiento!$AM$488","v":"FARMACIA"},null,null,{"$f":"Equipamiento!$BL$488*25/100/100","v":0},null,{"$f":"Equipamiento!$BK$488*25/100/100","v":4.1666666666666671E-2},{"$f":"IF(Equipamiento!$D$551=Equipamiento!$F$551, \"CUMPLE\", \"NO CUMPLE\")","v":"NO CUMPLE"}]
[{"$f":"Equipamiento!$AM$491","v":"ÁREA TECNICA"},null,null,null,{"$f":"Equipamiento!$BL$491*25/100/100","v":4.1666666666666671E-2},{"$f":"Equipamiento!$BK$491*25/100/100","v":4.1666666666666671E-2},{"$f":"IF(Equipamiento!$E$552=Equipamiento!$F$552, \"CUMPLE\", \"NO CUMPLE\")","v":"CUMPLE"}]
[{"$f":"Equipamiento!$AM$494","v":"REGISTROS Y ARCHIVOS CLÍNICOS"},null,null,{"$f":"Equipamiento!$BL$494*25/100/100","v":0},null,{"$f":"Equipamiento!$BK$494*25/100/100","v":2.0833333333333336E-2},{"$f":"IF(Equipamiento!$D$553=Equipamiento!$F$553, \"CUMPLE\", \"NO CUMPLE\")","v":"NO CUMPLE"}]
[{"$f":"Equipamiento!$AM$496","v":"ÁREA TÉCNICA"},null,null,null,{"$f":"Equipamiento!$BL$496*25/100/100","v":0},{"$f":"Equipamiento!$BK$496*25/100/100","v":2.0833333333333336E-2},{"$f":"IF(Equipamiento!$E$554=Equipamiento!$F$554, \"CUMPLE\", \"NO CUMPLE\")","v":"NO CUMPLE"}]
[{"$f":"AM497","v":"SERVICIO DE ADMINISTRACIÓN"},null,{"$f":"Equipamiento!$BL$497*25/100/100","v":0},null,null,{"$f":"Equipamiento!$BK$497*25/100/100","v":2.0833333333333336E-2},{"$f":"IF(Equipamiento!$C$555=Equipamiento!$F$555, \"CUMPLE\", \"NO CUMPLE\")","v":"NO CUMPLE"}]
[{"$f":"Equipamiento!$AM$498","v":"DIRECCIÓN Y GESTIÓN ADMINISTRATIVA"},null,null,{"$f":"Equipamiento!$BL$498*25/100/100","v":0},null,{"$f":"Equipamiento!$BK$498*25/100/100","v":2.0833333333333336E-2},{"$f":"IF(Equipamiento!$D$556=Equipamiento!$F$556, \"CUMPLE\", \"NO CUMPLE\")","v":"NO CUMPLE"}]
[{"$f":"Equipamiento!$AM$499","v":"DIRECCIÓN"},null,null,null,{"$f":"Equipamiento!$BL$499*25/100/100","v":0},{"$f":"Equipamiento!$BK$499*25/100/100","v":2.0833333333333336E-2},{"$f":"IF(Equipamiento!$E$557=Equipamiento!$F$557, \"CUMPLE\", \"NO CUMPLE\")","v":"NO CUMPLE"}]
[{"$f":"AM503","v":"SERVICIOS GENERALES"},null,{"$f":"Equipamiento!$BL$503*25/100/100","v":0},null,null,{"$f":"Equipamiento!$BK$503*25/100/100","v":0},{"$f":"IF(Equipamiento!$C$558=Equipamiento!$F$558, \"CUMPLE\", \"NO CUMPLE\")","v":"CUMPLE"}]
[{"$f":"Equipamiento!$AM$504","v":"BODEGA"},null,null,{"$f":"Equipamiento!$BL$504*25/100/100","v":0},null,{"$f":"Equipamiento!$BK$504*25/100/100","v":0},{"$f":"IF(Equipamiento!$D$559=Equipamiento!$F$559, \"CUMPLE\", \"NO CUMPLE\")","v":"CUMPLE"}]
[{"$f":"Equipamiento!$AM$505","v":"ÁREA DE ACCESO DE RECEPCION"},null,null,null,{"$f":"Equipamiento!$BL$505*25/100/100","v":0},{"$f":"Equipamiento!$BK$505*25/100/100","v":0},{"$f":"IF(Equipamiento!$E$560=Equipamiento!$F$560, \"CUMPLE\", \"NO CUMPLE\")","v":"CUMPLE"}]
["TOTAL REQUERIDO:",null,null,null,null,0.25,{"$f":"SUM(Equipamiento!$C$537                                                                    : Equipamiento!$C$560)","v":0}]
["TOTAL OPCIONAL:",null,null,null,null,0.25,{"$f":"Equipamiento!$BN$469*25/Equipamiento!$BM$469/100","v":0}]
["TOTAL DESEABLE:",null,null,null,null,0.25,{"$f":"25/100","v":0.25}]
["TOTAL CONDICIÓN:",null,null,null,null,0.25,{"$f":"25/100","v":0.25}]
["EQUIPO MEDICO:",null,"% Obtenido:","% Obtenido:","% Obtenido:","% A Cumplir:","% Final:"]
[{"$f":"Equipamiento!$AM$470","v":"SERVICIO DE ADMISIÓN Y CONSULTA EXTERNA"},null,{"$f":"Equipamiento!$BT$470*25/100/100","v":0},null,null,{"$f":"Equipamiento!$BS$470*25/100/100","v":0.17857142857142858},{"$f":"IF(Equipamiento!$C$566=Equipamiento!$F$566, \"CUMPLE\", \"NO CUMPLE\")","v":"NO CUMPLE"}]
[{"$f":"Equipamiento!$AM$471","v":"CONSULTA EXTERNA"},null,null,{"$f":"Equipamiento!$BT$471*25/100/100","v":0},null,{"$f":"Equipamiento!$BS$471*25/100/100","v":0.17857142857142858},{"$f":"IF(Equipamiento!$D$567=Equipamiento!$F$567, \"CUMPLE\", \"NO CUMPLE\")","v":"NO CUMPLE"}]
[{"$f":"Equipamiento!$AM$473","v":"AREA DE PACIENTE"},null,null,null,{"$f":"Equipamiento!$BT$473*25/100/100","v":0},{"$f":"Equipamiento!$BS$473*25/100/100","v":0.17857142857142858},{"$f":"IF(Equipamiento!$E$568=Equipamiento!$F$568, \"CUMPLE\", \"NO CUMPLE\")","v":"NO CUMPLE"}]
[{"$f":"$AM$474","v":"SERVICIO DE DIÁLISIS PERITONEAL"},null,{"$f":"Equipamiento!$BT$474*25/100/100","v":0},null,null,{"$f":"Equipamiento!$BS$474*25/100/100","v":0},{"$f":"IF(Equipamiento!$C$569=Equipamiento!$F$569, \"CUMPLE\", \"NO CUMPLE\")","v":"CUMPLE"}]
[{"$f":"Equipamiento!$AM$475","v":"ÁREA DE PROCEDIMIENTO  DE DIÁLISIS PERITONEAL"},null,null,{"$f":"Equipamiento!$BT$475*25/100/100","v":0},null,{"$f":"Equipamiento!$BS$475*25/100/100","v":0},{"$f":"IF(Equipamiento!$D$570=Equipamiento!$F$570, \"CUMPLE\", \"NO CUMPLE\")","v":"CUMPLE"}]
[{"$f":"Equipamiento!$AM$476","v":"ÁREA DE TRATAMIENTO"},null,null,null,{"$f":"Equipamiento!$BT$476*25/100/100","v":0},{"$f":"Equipamiento!$BS$476*25/100/100","v":0},{"$f":"IF(Equipamiento!$E$571=Equipamiento!$F$571, \"CUMPLE\", \"NO CUMPLE\")","v":"CUMPLE"}]
[{"$f":"$AM$479","v":"SERVICIO DE DIÁLISIS PERITONEAL"},null,{"$f":"Equipamiento!$BT$479*25/100/100","v":0},null,null,{"$f":"Equipamiento!$BS$479*25/100/100","v":1.785714285714286E-2},{"$f":"IF(Equipamiento!$C$572=Equipamiento!$F$572, \"CUMPLE\", \"NO CUMPLE\")","v":"NO CUMPLE"}]
[{"$f":"Equipamiento!$AM$480","v":"ÁREA DE TRATAMIENTO DE DIÁLISIS PERITONEAL"},null,null,{"$f":"Equipamiento!$BT$480*25/100/100","v":0},null,{"$f":"Equipamiento!$BS$480*25/100/100","v":1.785714285714286E-2},{"$f":"IF(Equipamiento!$D$573=Equipamiento!$F$573, \"CUMPLE\", \"NO CUMPLE\")","v":"NO CUMPLE"}]
[{"$f":"Equipamiento!$AM$481","v":"ÁREA DE TRATAMIENTO "},null,null,null,{"$f":"Equipamiento!$BT$481*25/100/100","v":0},{"$f":"Equipamiento!$BS$481*25/100/100","v":1.785714285714286E-2},{"$f":"IF(Equipamiento!$E$574=Equipamiento!$F$574, \"CUMPLE\", \"NO CUMPLE\")","v":"NO CUMPLE"}]
[{"$f":"Equipamiento!$AM$483","v":"SERVICIO DE DIAGNÓSTICO"},null,{"$f":"Equipamiento!$BT$483*25/100/100","v":0},null,null,{"$f":"Equipamiento!$BS$483*25/100/100","v":0},{"$f":"IF(Equipamiento!$C$575=Equipamiento!$F$575, \"CUMPLE\", \"NO CUMPLE\")","v":"CUMPLE"}]
[{"$f":"Equipamiento!$AM$484","v":"LABORATORIO - PUESTO DE TOMA DE MUESTRAS"},null,null,{"$f":"Equipamiento!$BT$484*25/100/100","v":0},null,{"$f":"Equipamiento!$BS$484*25/100/100","v":0},{"$f":"IF(Equipamiento!$D$576=Equipamiento!$F$576, \"CUMPLE\", \"NO CUMPLE\")","v":"CUMPLE"}]
[{"$f":"Equipamiento!$AM$486","v":"ÁREA DE PROCESAMIENTO"},null,null,null,{"$f":"Equipamiento!$BT$486*25/100/100","v":0},{"$f":"Equipamiento!$BS$486*25/100/100","v":0},{"$f":"IF(Equipamiento!$E$577=Equipamiento!$F$577, \"CUMPLE\", \"NO CUMPLE\")","v":"CUMPLE"}]
[{"$f":"Equipamiento!$AM$487","v":"SERVICIOS DE APOYO"},null,{"$f":"Equipamiento!$BT$487*25/100/100","v":0},null,null,{"$f":"Equipamiento!$BS$487*25/100/100","v":3.5714285714285719E-2},{"$f":"IF(Equipamiento!$C$578=Equipamiento!$F$578, \"CUMPLE\", \"NO CUMPLE\")","v":"NO CUMPLE"}]
[{"$f":"Equipamiento!$AM$488","v":"FARMACIA"},null,null,{"$f":"Equipamiento!$BT$488*25/100/100","v":0},null,{"$f":"Equipamiento!$BS$488*25/100/100","v":3.5714285714285719E-2},{"$f":"IF(Equipamiento!$D$579=Equipamiento!$F$579, \"CUMPLE\", \"NO CUMPLE\")","v":"NO CUMPLE"}]
[{"$f":"Equipamiento!$AM$489","v":"ÁREA ADMINISTRATIVA Y DE PERSONAL"},null,null,null,{"$f":"Equipamiento!$BT$489*25/100/100","v":0},{"$f":"Equipamiento!$BS$489*25/100/100","v":3.5714285714285719E-2},{"$f":"IF(Equipamiento!$E$580=Equipamiento!$F$580, \"CUMPLE\", \"NO CUMPLE\")","v":"NO CUMPLE"}]
[{"$f":"Equipamiento!$AM$497","v":"SERVICIO DE ADMINISTRACIÓN"},null,{"$f":"Equipamiento!$BT$497*25/100/100","v":0},null,null,{"$f":"Equipamiento!$BS$497*25/100/100","v":1.785714285714286E-2},{"$f":"IF(Equipamiento!$C$581=Equipamiento!$F$581, \"CUMPLE\", \"NO CUMPLE\")","v":"NO CUMPLE"}]
[{"$f":"Equipamiento!$AM$498","v":"DIRECCIÓN Y GESTIÓN ADMINISTRATIVA"},null,null,{"$f":"Equipamiento!$BT$498*25/100/100","v":0},null,{"$f":"Equipamiento!$BS$498*25/100/100","v":1.785714285714286E-2},{"$f":"IF(Equipamiento!$D$582=Equipamiento!$F$582, \"CUMPLE\", \"NO CUMPLE\")","v":"NO CUMPLE"}]
[{"$f":"Equipamiento!$AM$499","v":"DIRECCIÓN"},null,null,null,{"$f":"Equipamiento!$BT$499*25/100/100","v":0},{"$f":"Equipamiento!$BS$499*25/100/100","v":1.785714285714286E-2},{"$f":"IF(Equipamiento!$E$583=Equipamiento!$F$583, \"CUMPLE\", \"NO CUMPLE\")","v":"NO CUMPLE"}]
["TOTAL REQUERIDO:",null,null,null,null,0.25,{"$f":"SUM(Equipamiento!$C$566                                                                 : Equipamiento!$C$583)","v":0}]
["TOTAL OPCIONAL:",null,null,null,null,0.25,{"$f":"25/100","v":0.25}]
["TOTAL DESEABLE:",null,null,null,null,0.25,{"$f":"25/100","v":0.25}]
["TOTAL CONDICIÓN:",null,null,null,null,0.25,{"$f":"Equipamiento!$BZ$469*25/Equipamiento!$BY$469/100","v":0}]
["TOTALES COMPONENTE:"]
["TOTAL % REQUERIDO:",null,null,null,null,0.30000001192092896,{"$f":"(+Equipamiento!$G$511+Equipamiento!$G$532+Equipamiento!$G$561+Equipamiento!$G$584)*30/100","v":0}]
["TOTAL % OPCIONAL:",null,null,null,null,0.30000001192092896,{"$f":"(+Equipamiento!$G$512+Equipamiento!$G$533+Equipamiento!$G$562+Equipamiento!$G$585)*30/100","v":7.4999999999999997E-2}]
["TOTAL % DESEABLE:",null,null,null,null,0.30000001192092896,{"$f":"(+Equipamiento!$G$513+Equipamiento!$G$534+Equipamiento!$G$563+Equipamiento!$G$586)*30/100","v":0.22500000000000001}]
["TOTAL % CONDICIÓN:",null,null,null,null,0.30000001192092896,{"$f":"(+Equipamiento!$G$514+Equipamiento!$G$535+Equipamiento!$G$564+Equipamiento!$G$587)*30/100","v":0.22500000000000001}]

{"sheet":"Norma","index":6,"n_rows":109,"n_cols":30,"rows_kept":109,"cut":false,"hidden":false,"merged":[[105,0,105,4],[106,0,106,4],[107,0,107,4],[108,0,108,4],[104,0,104,6],[103,0,103,4],[95,0,95,1],[96,0,96,1],[97,0,97,1],[98,0,98,1],[99,0,99,1],[100,0,100,4],[101,0,101,4],[102,0,102,4],[89,0,89,1],[90,0,90,1],[91,0,91,1],[92,0,92,1],[93,0,93,1],[98,14,98,21],[95,14,95,21],[94,0,94,1],[96,14,96,21],[97,14,97,21],[94,14,94,21],[89,14,89,21],[90,14,90,21],[91,14,91,21],[92,14,92,21],[93,14,93,21],[46,0,46,8],[88,14,88,21],[87,0,87,8],[88,0,88,1],[54,0,54,8],[55,0,55,8],[63,0,63,8],[64,0,64,8],[76,0,76,8],[4,0,4,8],[5,0,5,8],[12,0,12,8],[32,0,32,8],[33,0,33,8],[1,0,1,8],[2,0,2,8],[2,14,2,21],[2,22,2,29],[3,0,3,8]]}
["FILTROS:","Anx:","Requerido:","Servicios /  Consultorios:","Tipo:","Posee:","No Posee:","Calif:","Observaciones:"]
[{"$f":"Menu!$B$3","v":"CENTRO ESPECIALIZADO EN DIÁLISIS PERITONEAL"}]
["NORMATIVA",null,null,null,null,null,null,null,null,null,null,null,null,null,"NORMAS",null,null,null,null,null,null,null,"TOTAL NORMAS"]
["NORMA TÉCNICA",null,null,null,null,null,null,null,null,null,null,null,null,null,null,null,null,null,null,null,null,null,{"$f":"SUM(O5:O87)","v":490},0,0,0,0,0,150,0]
["SERVICIO DE ADMISIÓN Y CONSULTA EXTERNA",null,null,null,null,null,null,null,null,null,null,null,null,null,null,null,null,null,null,null,null,null,{"$f":"SUM(O6:O32)","v":160},{"$f":"SUM(P6:P32)","v":0},0,0,0,0,60,0]
["ADMISIÓN Y ESTADISTICA",null,null,null,null,null,null,null,null,null,null,null,null,null,null,null,null,null,null,null,null,null,{"$f":"SUM(O7:O12)","v":50},{"$f":"SUM(P7:P12)","v":0},0,0,0,0,0,0]
["MANUAL DE NORMAS DE ADMISION Y ESTADISTICA",{"$f":"B1","v":"Anx:"},{"$f":"C$1","v":"Requerido:"},"Servicios /  Consultorios:","Tipo:","Posee:","No Posee:","Calif:","Observaciones:",null,null,null,null,null,null,null,null,null,null,null,null,null,{"$f":"SUM(O8:O12)","v":50},0,0,0,0,0,0,0]
["Manual del Sistema Común de Información",null,1,null,"Requerido",0,0,{"$f":"IF(AND(F8>=C8,C8>0,F8>=1),10,0)","v":0},null,null,null,null,null,null,{"$f":"IF(UPPER(E8)=\"REQUERIDO\", 10, \"\")","v":10},{"$f":"IF(UPPER(E8)=\"REQUERIDO\", H8, \"\")","v":0}]
["Normas de archivo de historias clínicas",null,1,null,"Requerido",0,0,{"$f":"IF(AND(F9>=C9,C9>0,F9>=1),10,0)","v":0},null,null,null,null,null,null,{"$f":"IF(UPPER(E9)=\"REQUERIDO\", 10, \"\")","v":10},{"$f":"IF(UPPER(E9)=\"REQUERIDO\", H9, \"\")","v":0}]
["Reglamento Interno",null,1,null,"Requerido",0,0,{"$f":"IF(AND(F10>=C10,C10>0,F10>=1),10,0)","v":0},null,null,null,null," ",null,{"$f":"IF(UPPER(E10)=\"REQUERIDO\", 10, \"\")","v":10},{"$f":"IF(UPPER(E10)=\"REQUERIDO\", H10, \"\")","v":0}]
["Reglamento de Señalización de Seguridad para Establecimientos de Salud",null,1,null,"Requerido",0,0,{"$f":"IF(AND(F11>=C11,C11>0,F11>=1),10,0)","v":0},null,null,null,null,null,null,{"$f":"IF(UPPER(E11)=\"REQUERIDO\", 10, \"\")","v":10},{"$f":"IF(UPPER(E11)=\"REQUERIDO\", H11, \"\")","v":0}]
["Registro de Sistema de Información y Análisis Estadístico que Incluya: Consultas, Interconsultas, Procedimientos, Índice de Infecciones, Morbimortalidad, Manejo de Accesos Vasculares, Anemia, Hipertensión Arterial, Enfermedad Ósea, Nutrición, Atención Psicológica, Trabajo Socia y Complicaciones de la hemodiálisis.",null,1,null,"Requerido",0,0,{"$f":"IF(AND(F12>=C12,C12>0,F12>=1),10,0)","v":0},null,null,null,null,null,null,{"$f":"IF(UPPER(E12)=\"REQUERIDO\", 10, \"\")","v":10},{"$f":"IF(UPPER(E12)=\"REQUERIDO\", H12, \"\")","v":0}]
["CONSULTA EXTERNA",null,null,null,null,null,null,null,null,null,null,null,null,null,null,null,null,null,null,null,null,null,{"$f":"SUM(O14:O32)","v":110},{"$f":"SUM(P14:P32)","v":0},0,0,0,0,60,0]
["MANUAL DE NORMAS CONSULTA EXTERNA",{"$f":"B1","v":"Anx:"},{"$f":"C$1","v":"Requerido:"},"Servicios /  Consultorios:","Tipo:","Posee:","No Posee:","Calif:","Observaciones:",null,null,null,null,null,null,null,null,null,null,null,null,null,{"$f":"SUM(O15:O25)","v":110},{"$f":"SUM(P15:P25)","v":0},0,0,0,0,0,0]
["Manual de procedimientos de diálisis peritoneal ",null,{"$f":"ROUNDUP(D15/1,0)","v":1},1,"Requerido",0,0,{"$f":"IF(AND(F15>=C15,C15>0,F15>=1),10,0)","v":0},null,null,null,null,null,null,{"$f":"IF(UPPER(E15)=\"REQUERIDO\", 10, \"\")","v":10},{"$f":"IF(UPPER(E15)=\"REQUERIDO\", H15, \"\")","v":0}]
["Protocolos de atención",null,1,1,"Requerido",0,0,0,null,null,null,null,null,null,10,0]
["Normas de Bioseguridad específicas",null,1,1,"Requerido",0,0,0,null,null,null,null,null,null,10,0]
["Reglamento de Señalización de Seguridad para Establecimientos de Salud",null,1,1,"Requerido",0,0,0,null,null,null,null,null,null,10,0]
["Reglamento Interno",null,1,1,"Requerido",0,0,0,null,null,null,null,null,null,10,0]
["Registro de Memorias Técnicas de Equipos para mantenimiento preventivo ",null,1,1,"Requerido",0,0,0,null,null,null,null,null,null,10,0]
["Manual de Referencia y Contrarreferencia",null,1,1,"Requerido",0,0,0,null,null,null,null,null,null,10,0]
["Registro de Evolución de la Atención Médica y Procedimiento Efectuado",null,1,1,"Requerido",0,0,0,null,null,null,null,null,null,10,0]
["Registro de Indicadores para la Satisfacción del Usuario",null,1,1,"Requerido",0,0,0,null,null,null,null,null,null,10,0]
["Sistema de Evaluación del Personal en el que consten la Periodicidad y la Finalidad ",null,1,1,"Requerido",0,0,0,null,null,null,null,null,null,10,0]
["Registro del Programa de Capacitación Continua para Actualización del Personal ",null,1,1,"Requerido",0,0,0,null,null,null,null,null,null,10,0]
["MANUAL DE  NORMAS DE ENFERMERIA",{"$f":"B1","v":"Anx:"},{"$f":"C$1","v":"Requerido:"},"Servicios /  Consultorios:","Tipo:","Posee:","No Posee:","Calif:","Observaciones:",null,null,null,null,null,null,null,null,null,null,null,null,null,{"$f":"SUM(O27:O32)","v":0},{"$f":"SUM(P27:P32)","v":0},0,0,0,0,60,0]
["Manual de procedimientos de Enfermería",null,{"$f":"ROUNDUP(D27/1,0)","v":1},1,"Condición",0,0,{"$f":"IF(AND(F27>=C27,C27>0,F27>=1),10,0)","v":0},null,null,null,null,null,null,null,null,null,null,null,null,{"$f":"IF(UPPER(E27)=\"CONDICIÓN\", 10, 0)","v":10},{"$f":"IF(UPPER(E27)=\"CONDICIÓN\", H27, \"\")","v":0}]
["Normas de bioseguridad específica",null,1,1,"Condición",0,0,0,null,null,null,null,null,null,null,null,null,null,null,null,10,0]
["Memoria técnica de instalación, reemplazo y funcionamiento de equipos y mobiliario",null,1,1,"Condición",0,0,0,null,null,null,null,null,null,null,null,null,null,null,null,10,0]
["Reglamento Interno",null,1,1,"Condición",0,0,0,null,null,null,null,null,null,null,null,null,null,null,null,10,0]
["Reglamento de eliminación de desechos peligrosos",null,1,1,"Condición",0,0,0,null,null,null,null,null,null,null,null,null,null,null,null,10,0]
["Reglamento de Señalización de Seguridad para Establecimientos de Salud",null,1,1,"Condición",0,0,0,null,null,null,null,null,null,null,null,null,null,null,null,10,0]
["SERVICIO DE DIÁLISIS PERITONEAL",null,null,null,null,null,null,null,null,null,null,null,null,null,null,null,null,null,null,null,null,null,{"$f":"SUM(O34:O54)","v":170},0,0,0,0,0,0,0]
["DIÁLISIS PERITONEAL",null,null,null,null,null,null,null,null,null,null,null,null,null,null,null,null,null,null,null,null,null,{"$f":"SUM(O35:O46)","v":110},{"$f":"SUM(P35:P46)","v":0},0,0,0,0,0,0]
["MANUAL DE NORMAS DEL ÁREA DE TRATAMIENTO",{"$f":"B1","v":"Anx:"},{"$f":"C$1","v":"Requerido:"},"Servicios /  Consultorios:","Tipo:","Posee:","No Posee:","Calif:","Observaciones:",null,null,null,null,null,null,null,null,null,null,null,null,null,{"$f":"SUM(O36:O46)","v":110},{"$f":"SUM(P36:P46)","v":0},0,0,0,0,0,0]
["Manual de procedimientos de Diálisis Peritoneal ",null,{"$f":"ROUNDUP(D36/1,0)","v":1},1,"Requerido",0,0,{"$f":"IF(AND(F36>=C36,C36>0,F36>=1),10,0)","v":0},null,null,null,null,null,null,{"$f":"IF(UPPER(E36)=\"REQUERIDO\", 10, \"\")","v":10},{"$f":"IF(UPPER(E36)=\"REQUERIDO\", H36, \"\")","v":0}]
["Protocolos de atención",null,1,1,"Requerido",0,0,0,null,null,null,null,null,null,10,0]
["Normas de Bioseguridad específicas",null,1,1,"Requerido",0,0,0,null,null,null,null,null,null,10,0]
["Reglamento de Señalización de Seguridad para Establecimientos de Salud",null,1,1,"Requerido",0,0,0,null,null,null,null,null,null,10,0]
["Reglamento Interno",null,1,1,"Requerido",0,0,0,null,null,null,null,null,null,10,0]
["Registro de Memorias Técnicas de Equipos para mantenimiento Preventivo de Máquinas de Hemodiálisis",null,1,1,"Requerido",0,0,0,null,null,null,null,null,null,10,0]
["Manual de Referencia y Contrarreferencia",null,1,1,"Requerido",0,0,0,null,null,null,null,null,null,10,0]
["Registro de Evolución de la Atención Médica y Procedimiento Efectuado",null,1,1,"Requerido",0,0,0,null,null,null,null,null,null,10,0]
["Registro de Indicadores para la Satisfacción del Usuario",null,1,1,"Requerido",0,0,0,null,null,null,null,null,null,10,0]
["Sistema de Evaluación del Personal en el que consten la Periodicidad y la Finalidad ",null,1,1,"Requerido",0,0,0,null,null,null,null,null,null,10,0]
["Registro del Programa de Capacitación Continua para Actualización del Personal ",null,1,1,"Requerido",0,0,0,null,null,null,null,null,null,10,0]
["ENFERMERÍA",null,null,null,null,null,null,null,null,null,null,null,null,null,null,null,null,null,null,null,null,null,{"$f":"SUM(O48:O54)","v":60},{"$f":"SUM(P48:P54)","v":0},0,0,0,0,0,0]
["MANUAL DE  NORMAS DE ENFERMERIA",{"$f":"B1","v":"Anx:"},{"$f":"C$1","v":"Requerido:"},"Servicios /  Consultorios:","Tipo:","Posee:","No Posee:","Calif:","Observaciones:",null,null,null,null,null,null,null,null,null,null,null,null,null,{"$f":"SUM(O49:O54)","v":60},{"$f":"SUM(P49:P54)","v":0},0,0,0,0,0,0]
["Manual de procedimientos de Enfermería",null,{"$f":"ROUNDUP(D49/1,0)","v":1},1,"Requerido",0,0,{"$f":"IF(AND(F49>=C49,C49>0,F49>=1),10,0)","v":0},null,null,null,null,null,null,{"$f":"IF(UPPER(E49)=\"REQUERIDO\", 10, \"\")","v":10},{"$f":"IF(UPPER(E49)=\"REQUERIDO\", H49, \"\")","v":0}]
["Normas de bioseguridad específica",null,1,1,"Requerido",0,0,0,null,null,null,null,null,null,10,0]
["Memoria técnica de instalación, reemplazo y funcionamiento de equipos y mobiliario",null,1,1,"Requerido",0,0,0,null,null,null,null,null,null,10,0]
["Reglamento Interno",null,1,1,"Requerido",0,0,0,null,null,null,null,null,null,10,0]
["Reglamento de eliminación de desechos peligrosos",null,1,1,"Requerido",0,0,0,null,null,null,null,null,null,10,0]
["Reglamento de Señalización de Seguridad para Establecimientos de Salud",null,1,1,"Requerido",0,0,0,null,null,null,null,null,null,10,0]
["SERVICIO DE APOYO",null,null,null,null,null,null,null,null,null,null,null,null,null,null,null,null,null,null,null,null,null,{"$f":"SUM(O56:O63)","v":60},{"$f":"SUM(P56:P63)","v":0},0,0,0,0,0,0]
["FARMACIA",null,null,null,null,null,null,null,null,null,null,null,null,null,null,null,null,null,null,null,null,null,{"$f":"SUM(O57:O63)","v":60},{"$f":"SUM(P57:P63)","v":0},0,0,0,0,0,0]
["MANUAL DE NORMAS DE FARMACIA",{"$f":"B1","v":"Anx:"},{"$f":"C$1","v":"Requerido:"},"Servicios /  Consultorios:","Tipo:","Posee:","No Posee:","Calif:","Observaciones:",null,null,null,null,null,null,null,null,null,null,null,null,null,{"$f":"SUM(O58:O63)","v":60},{"$f":"SUM(P58:P63)","v":0},0,0,0,0,0,0]
["Cuadro Nacional Básico de Medicamentos",null,1,null,"Requerido",0,0,{"$f":"IF(AND(F58>=C58,C58>0,F58>=1),10,0)","v":0},null,null,null,null,null,null,{"$f":"IF(UPPER(E58)=\"REQUERIDO\", 10, \"\")","v":10},{"$f":"IF(UPPER(E58)=\"REQUERIDO\", H58, \"\")","v":0}]
["Ley de Medicamentos Genéricos",null,1,null,"Requerido",0,0,0,null,null,null,null,null,null,10,0]
["Reglamento Interno",null,1,null,"Requerido",0,0,0,null,null,null,null,null,null,10,0]
["Manual de procedimientos de dispensación y suministro",null,1,null,"Requerido",0,0,0,null,null,null,null,null,null,10,0]
["Lista actualizada de medicamentos del SUGMI *",null,1,null,"Requerido",0,0,{"$f":"IF(AND(F62>=C62,C62>0,F62>=1),10,0)","v":0},null,null,null,null,null,null,10,0]
["Reglamento de Señalización de Seguridad para Establecimientos de Salud",null,1,null,"Requerido",0,0,0,null,null,null,null,null,null,10,0]
["SERVICIO DE ADMINISTRACIÓN",null,null,null,null,null,null,null,null,null,null,null,null,null,null,null,null,null,null,null,null,null,{"$f":"SUM(O65:O76)","v":100},{"$f":"SUM(P65:P76)","v":0},0,0,0,0,0,0]
["DIRECCIÓN Y GESTIÓN ADMINISTRATIVA",null,null,null,null,null,null,null,null,null,null,null,null,null,null,null,null,null,null,null,null,null,{"$f":"SUM(O66:O76)","v":100},{"$f":"SUM(P66:P76)","v":0},0,0,0,0,0,0]
["MANUAL DE NORMAS DE DIRECCION Y ANEXOS",{"$f":"B1","v":"Anx:"},{"$f":"C$1","v":"Requerido:"},"Servicios /  Consultorios:","Tipo:","Posee:","No Posee:","Calif:","Observaciones:",null,null,null,null,null,null,null,null,null,null,null,null,null,{"$f":"SUM(O67:O76)","v":100},{"$f":"SUM(P67:P76)","v":0},0,0,0,0,0,0]
["Estructura organizacional",null,1,null,"Requerido",0,0,{"$f":"IF(AND(F67>=C67,C67>0,F67>=1),10,0)","v":0},null,null,null,null,null,null,{"$f":"IF(UPPER(E67)=\"REQUERIDO\", 10, \"\")","v":10},{"$f":"IF(UPPER(E67)=\"REQUERIDO\", H67, \"\")","v":0}]
["Estatutos y requerimientos legales de funcionamiento",null,1,null,"Requerido",0,0,0,null,null,null,null,null,null,10,0]
["Reglamento Interno",null,1,null,"Requerido",0,0,0,null,null,null,null,null,null,10,0]
["Plan de emergencia y desastres",null,1,null,"Requerido",0,0,0,null,null,null,null,null,null,10,0]
["Reglamento de los comités técnicos (según complejidad de la unidad)",null,1,null,"Requerido",0,0,0,null,null,null,null,null,null,10,0]
["Plan estratégico y operativo*",null,1,null,"Requerido",0,0,0,null,null,null,null,null,null,10,0]
["Manual de normas epidemiológicas, administrativas, financieras y de recursos humanos**",null,1,null,"Requerido",0,0,0,null,null,null,null,null,null,10,0]
["Reglamento de Señalización de Seguridad para Establecimientos de Salud",null,1,null,"Requerido",0,0,0,null,null,null,null,null,null,10,0]
["Reglamento Interno de Funciones del Personal del Centro inscrito en el Ministerio de Relaciones Laborales",null,1,null,"Requerido",0,0,0,null,null,null,null,null,null,10,0]
["Reglamento Interno de seguridad y Salud Ocupacional ",null,1,null,"Requerido",0,0,0,null,null,null,null,null,null,10,0]
["MANTENIMIENTO",null,null,null,null,null,null,null,null,null,null,null,null,null,null,null,null,null,null,null,null,null,{"$f":"SUM(O78:O87)","v":0},{"$f":"SUM(P78:P87)","v":0},0,0,0,0,{"$f":"SUM(U78:U87)","v":90},{"$f":"SUM(V78:V87)","v":0}]
["MANUAL DE NORMAS DE MANTENIMIENTO",{"$f":"B1","v":"Anx:"},{"$f":"C$1","v":"Requerido:"},"Servicios /  Consultorios:","Tipo:","Posee:","No Posee:","Calif:","Observaciones:",null,null,null,null,null,null,null,null,null,null,null,null,null,{"$f":"SUM(O79:O87)","v":0},{"$f":"SUM(P79:P87)","v":0},{"$f":"SUM(Q79:Q87)","v":0},{"$f":"SUM(R79:R87)","v":0},{"$f":"SUM(S79:S87)","v":0},{"$f":"SUM(T79:T87)","v":0},{"$f":"SUM(U79:U87)","v":90},{"$f":"SUM(V79:V87)","v":0}]
["Reglamento Interno",null,1,null,"Condición",0,0,{"$f":"IF(AND(F79>=C79,C79>0,F79>=1),10,0)","v":0},null,null,null,null,null,null,null,null,null,null,null,null,{"$f":"IF(UPPER(E79)=\"CONDICIÓN\", 10, \"\")","v":10},{"$f":"IF(UPPER(E79)=\"CONDICIÓN\", H79, \"\")","v":0}]
["Memoria técnica de mantenimiento de estructura, instalaciones, equipos y mobiliario",null,1,null,"Condición",0,0,0,null,null,null,null,null,null,null,null,null,null,null,null,{"$f":"IF(UPPER(E80)=\"CONDICIÓN\", 10, \"\")","v":10},{"$f":"IF(UPPER(E80)=\"CONDICIÓN\", H80, \"\")","v":0}]
["Reglamento de Señalización de Seguridad para Establecimientos de Salud",null,1,null,"Condición",0,0,0,null,null,null,null,null,null,null,null,null,null,null,null,{"$f":"IF(UPPER(E81)=\"CONDICIÓN\", 10, \"\")","v":10},{"$f":"IF(UPPER(E81)=\"CONDICIÓN\", H81, \"\")","v":0}]
["Memoria Técnica de Mantenimiento Preventivo y Correctivo de Planta de Tratamiento de Agua",null,1,null,"Condición",0,0,0,null,null,null,null,null,null,null,null,null,null,null,null,10,0]
["Registro de Evaluación Microbiológica y composición Química del Agua",null,1,null,"Condición",0,0,0,null,null,null,null,null,null,null,null,null,null,null,null,10,0]
["Registro de Control y Limpieza periódica de los Filtros del Aire Acondicionado",null,1,null,"Condición",0,0,0,null,null,null,null,null,null,null,null,null,null,null,null,10,0]
["Registro de mantenimientos y recargas de Extintores",null,1,null,"Condición",0,0,0,null,null,null,null,null,null,null,null,null,null,null,null,10,0]
["Certificado de Inspección y Aprobación por bomberos, autoridad competente, de los sensores de Humo",null,1,null,"Condición",0,0,0,null,null,null,null,null,null,null,null,null,null,null,null,10,0]
["Registro de Desinfección de Máquinas",null,1,null,"Condición",0,0,0,null,null,null,null,null,null,null,null,null,null,null,null,10,0]
["TOTALES PARCIALES:",null,null,null,null,null,null,null,null,null,null,null,null,null,"TOTAL GENERAL:",null,null,null,null,null,null,null,{"$f":"(+Norma!$W$4)","v":490},{"$f":"(+Norma!$X$4)","v":0},{"$f":"(+Norma!$Y$4)","v":0},{"$f":"(+Norma!$Z$4)","v":0},{"$f":"(+Norma!$AA$4)","v":0},{"$f":"(+Norma!$AB$4)","v":0},{"$f":"(+Norma!$AC$4)","v":150},{"$f":"(+Norma!$AD$4)","v":0}]
["NORMAS:",null,"% Obtenido:","% Obtenido:","% Obtenido:","% A Cumplir:","% Final:",null,null,null,null,null,null,null,"NORMA TÉCNICA",null,null,null,null,null,null,null,{"$f":"W4*100/W88","v":100},{"$f":"X4*100/W88","v":0},{"$f":"Y4*100/Y88","v":{"$error":"#DIV/0!"}},{"$f":"Z4*100/Y88","v":{"$error":"#DIV/0!"}},{"$f":"AA4*100/AA88","v":{"$error":"#DIV/0!"}},{"$f":"AB4*100/AA88","v":{"$error":"#DIV/0!"}},{"$f":"AC4*100/AC88","v":100},{"$f":"AD4*100/AC88","v":0}]
[{"$f":"Norma!$O$89","v":"NORMA TÉCNICA"},null,{"$f":"Norma!$X$89*100/100/100","v":0},null,null,{"$f":"Norma!$W$89*100/100/100","v":1},{"$f":"IF(Norma!$C$90=Norma!$F$90, \"CUMPLE\", \"NO CUMPLE\")","v":"NO CUMPLE"},null,null,null,null,null,null,null,"SERVICIO DE ADMISIÓN Y CONSULTA EXTERNA",null,null,null,null,null,null,null,{"$f":"W5*100/W88","v":32.653061224489797},{"$f":"X5*100/W88","v":0},{"$f":"Y5*100/Y88","v":{"$error":"#DIV/0!"}},{"$f":"Z5*100/Y88","v":{"$error":"#DIV/0!"}},{"$f":"AA5*100/AA88","v":{"$error":"#DIV/0!"}},{"$f":"AB5*100/AA88","v":{"$error":"#DIV/0!"}},{"$f":"AC5*100/AC88","v":40},{"$f":"AD5*100/AC88","v":0}]
[{"$f":"Norma!$O$90","v":"SERVICIO DE ADMISIÓN Y CONSULTA EXTERNA"},null,null,{"$f":"Norma!$X$90*100/100/100","v":0},null,{"$f":"Norma!$W$90*100/100/100","v":0.32653061224489799},{"$f":"IF(Norma!$D$91=Norma!$F$91, \"CUMPLE\", \"NO CUMPLE\")","v":"NO CUMPLE"},null,null,null,null,null,null,null,"ADMISIÓN Y ESTADISTICA",null,null,null,null,null,null,null,{"$f":"W6*100/W88","v":10.204081632653061},{"$f":"X6*100/W88","v":0},{"$f":"Y6*100/Y88","v":{"$error":"#DIV/0!"}},{"$f":"Z6*100/Y88","v":{"$error":"#DIV/0!"}},{"$f":"AA6*100/AA88","v":{"$error":"#DIV/0!"}},{"$f":"AB6*100/AA88","v":{"$error":"#DIV/0!"}},{"$f":"AC6*100/AC88","v":0},{"$f":"AD6*100/AC88","v":0}]
[{"$f":"Norma!$O$91","v":"ADMISIÓN Y ESTADISTICA"},null,null,null,{"$f":"Norma!$X$91*100/100/100","v":0},{"$f":"Norma!$W$91*100/100/100","v":0.10204081632653061},{"$f":"IF(Norma!$E$92=Norma!$F$92, \"CUMPLE\", \"NO CUMPLE\")","v":"NO CUMPLE"},null,null,null,null,null,null,null,"CONSULTA EXTERNA",null,null,null,null,null,null,null,{"$f":"W13*100/W88","v":22.448979591836736},{"$f":"X13*100/W88","v":0},{"$f":"Y13*100/Y88","v":{"$error":"#DIV/0!"}},{"$f":"Z13*100/Y88","v":{"$error":"#DIV/0!"}},{"$f":"AA13*100/AA88","v":{"$error":"#DIV/0!"}},{"$f":"AB13*100/AA88","v":{"$error":"#DIV/0!"}},{"$f":"AC13*100/AC88","v":40},{"$f":"AD13*100/AC88","v":0}]
[{"$f":"Norma!$O$92","v":"CONSULTA EXTERNA"},null,null,null,{"$f":"Norma!$X$92*100/100/100","v":0},{"$f":"Norma!$W$92*100/100/100","v":0.22448979591836735},{"$f":"IF(Norma!$E$93=Norma!$F$93, \"CUMPLE\", \"NO CUMPLE\")","v":"NO CUMPLE"},null,null,null,null,null,null,null,"SERVICIO DE DIÁLISIS PERITONEAL",null,null,null,null,null,null,null,{"$f":"W33*100/W88","v":34.693877551020407},{"$f":"X33*100/W88","v":0},{"$f":"Y33*100/Y88","v":{"$error":"#DIV/0!"}},{"$f":"Z33*100/Y88","v":{"$error":"#DIV/0!"}},{"$f":"AA33*100/AA88","v":{"$error":"#DIV/0!"}},{"$f":"AB33*100/AA88","v":{"$error":"#DIV/0!"}},{"$f":"AC33*100/AC88","v":0},{"$f":"AD33*100/AC88","v":0}]
[{"$f":"Norma!$O$93","v":"SERVICIO DE DIÁLISIS PERITONEAL"},null,null,{"$f":"Norma!$X$93*100/100/100","v":0},null,{"$f":"Norma!$W$93*100/100/100","v":0.34693877551020408},{"$f":"IF(Norma!$D$94=Norma!$F$94, \"CUMPLE\", \"NO CUMPLE\")","v":"NO CUMPLE"},null,null,null,null,null,null,null,"DIÁLISIS PERITONEAL",null,null,null,null,null,null,null,{"$f":"W34*100/W88","v":22.448979591836736},{"$f":"X34*100/W88","v":0},{"$f":"Y34*100/Y88","v":{"$error":"#DIV/0!"}},{"$f":"Z34*100/Y88","v":{"$error":"#DIV/0!"}},{"$f":"AA34*100/AA88","v":{"$error":"#DIV/0!"}},{"$f":"AB34*100/AA88","v":{"$error":"#DIV/0!"}},{"$f":"AC34*100/AC88","v":0},{"$f":"AD34*100/AC88","v":0}]
[{"$f":"Norma!$O$94","v":"DIÁLISIS PERITONEAL"},null,null,null,{"$f":"Norma!$X$94*100/100/100","v":0},{"$f":"Norma!$W$94*100/100/100","v":0.22448979591836735},{"$f":"IF(Norma!$E$95=Norma!$F$95, \"CUMPLE\", \"NO CUMPLE\")","v":"NO CUMPLE"},null,null,null,null,null,null,null,"ENFERMERÍA",null,null,null,null,null,null,null,{"$f":"W47*100/W88","v":12.244897959183673},{"$f":"X47*100/W88","v":0},{"$f":"Y47*100/Y88","v":{"$error":"#DIV/0!"}},{"$f":"Z47*100/Y88","v":{"$error":"#DIV/0!"}},{"$f":"AA47*100/AA88","v":{"$error":"#DIV/0!"}},{"$f":"AB47*100/AA88","v":{"$error":"#DIV/0!"}},{"$f":"AC47*100/AC88","v":0},{"$f":"AD47*100/AC88","v":0}]
[{"$f":"Norma!$O$95","v":"ENFERMERÍA"},null,null,null,{"$f":"Norma!$X$95*100/100/100","v":0},{"$f":"Norma!$W$95*100/100/100","v":0.12244897959183673},{"$f":"IF(Norma!$E$96=Norma!$F$96, \"CUMPLE\", \"NO CUMPLE\")","v":"NO CUMPLE"},null,null,null,null,null,null,null,"SERVICIO DE APOYO",null,null,null,null,null,null,null,{"$f":"W55*100/W88","v":12.244897959183673},{"$f":"X55*100/W88","v":0},{"$f":"Y55*100/Y88","v":{"$error":"#DIV/0!"}},{"$f":"Z55*100/Y88","v":{"$error":"#DIV/0!"}},{"$f":"AA55*100/AA88","v":{"$error":"#DIV/0!"}},{"$f":"AB55*100/AA88","v":{"$error":"#DIV/0!"}},{"$f":"AC55*100/AC88","v":0},{"$f":"AD55*100/AC88","v":0}]
[{"$f":"Norma!$O$96","v":"SERVICIO DE APOYO"},null,null,{"$f":"Norma!$X$96*100/100/100","v":0},null,{"$f":"Norma!$W$96*100/100/100","v":0.12244897959183673},{"$f":"IF(Norma!$D$97=Norma!$F$97, \"CUMPLE\", \"NO CUMPLE\")","v":"NO CUMPLE"},null,null,null,null,null,null,null,"FARMACIA",null,null,null,null,null,null,null,{"$f":"W56*100/W88","v":12.244897959183673},{"$f":"X56*100/W88","v":0},{"$f":"Y56*100/Y88","v":{"$error":"#DIV/0!"}},{"$f":"Z56*100/Y88","v":{"$error":"#DIV/0!"}},{"$f":"AA56*100/AA88","v":{"$error":"#DIV/0!"}},{"$f":"AB56*100/AA88","v":{"$error":"#DIV/0!"}},{"$f":"AC56*100/AC88","v":0},{"$f":"AD56*100/AC88","v":0}]
[{"$f":"Norma!$O$97","v":"FARMACIA"},null,null,null,{"$f":"Norma!$X$97*100/100/100","v":0},{"$f":"Norma!$W$97*100/100/100","v":0.12244897959183673},{"$f":"IF(Norma!$E$98=Norma!$F$98, \"CUMPLE\", \"NO CUMPLE\")","v":"NO CUMPLE"},null,null,null,null,null,null,null,"SERVICIO DE ADMINISTRACIÓN",null,null,null,null,null,null,null,{"$f":"W64*100/W88","v":20.408163265306122},{"$f":"X64*100/W88","v":0},{"$f":"Y64*100/Y88","v":{"$error":"#DIV/0!"}},{"$f":"Z64*100/Y88","v":{"$error":"#DIV/0!"}},{"$f":"AA64*100/AA88","v":{"$error":"#DIV/0!"}},{"$f":"AB64*100/AA88","v":{"$error":"#DIV/0!"}},{"$f":"AC64*100/AC88","v":0},{"$f":"AD64*100/AC88","v":0}]
[{"$f":"Norma!$O$98","v":"SERVICIO DE ADMINISTRACIÓN"},null,null,{"$f":"Norma!$X$98*100/100/100","v":0},null,{"$f":"Norma!$W$98*100/100/100","v":0.20408163265306123},{"$f":"IF(Norma!$D$99=Norma!$F$99, \"CUMPLE\", \"NO CUMPLE\")","v":"NO CUMPLE"},null,null,null,null,null,null,null,"MANTENIMIENTO",null,null,null,null,null,null,null,{"$f":"W77*100/W88","v":0},{"$f":"X77*100/W88","v":0},{"$f":"Y77*100/Y88","v":{"$error":"#DIV/0!"}},{"$f":"Z77*100/Y88","v":{"$error":"#DIV/0!"}},{"$f":"AA77*100/AA88","v":{"$error":"#DIV/0!"}},{"$f":"AB77*100/AA88","v":{"$error":"#DIV/0!"}},{"$f":"AC77*100/AC88","v":60},{"$f":"AD77*100/AC88","v":0}]
[{"$f":"Norma!$O$99","v":"MANTENIMIENTO"},null,null,null,{"$f":"Norma!$X$99*100/100/100","v":0},{"$f":"Norma!$W$99*100/100/100","v":0},{"$f":"IF(Norma!$E$100=Norma!$F$100, \"CUMPLE\", \"NO CUMPLE\")","v":"CUMPLE"}]
["TOTAL REQUERIDO:",null,null,null,null,1,{"$f":"SUM(Norma!$C$90                                                          : Norma!$C$100)","v":0}]
["TOTAL OPCIONAL:",null,null,null,null,1,{"$f":"100/100","v":1}]
["TOTAL DESEABLE:",null,null,null,null,1,{"$f":"100/100","v":1}]
["TOTAL CONDICIÓN:",null,null,null,null,1,{"$f":"Norma!$AD$88*100/Norma!$AC$88/100","v":0}]
["TOTALES COMPONENTE:"]
["TOTAL % REQUERIDO:",null,null,null,null,5.000000074505806E-2,{"$f":"(+Norma!$G$101)*5/100","v":0}]
["TOTAL % OPCIONAL:",null,null,null,null,5.000000074505806E-2,{"$f":"(+Norma!$G$102)*5/100","v":0.05}]
["TOTAL % DESEABLE:",null,null,null,null,5.000000074505806E-2,{"$f":"(+Norma!$G$103)*5/100","v":0.05}]
["TOTAL % CONDICIÓN:",null,null,null,null,5.000000074505806E-2,{"$f":"(+Norma!$G$104)*5/100","v":0}]

{"sheet":"TalentoHumano","index":7,"n_rows":51,"n_cols":46,"rows_kept":51,"cut":false,"hidden":false,"merged":[[47,0,47,4],[48,0,48,4],[49,0,49,4],[50,0,50,4],[46,0,46,6],[45,0,45,4],[34,0,34,4],[35,0,35,4],[36,0,36,4],[37,0,37,4],[38,0,38,1],[39,0,39,1],[40,0,40,1],[41,0,41,1],[42,0,42,4],[43,0,43,4],[44,0,44,4],[30,22,30,29],[31,22,31,29],[32,22,32,29],[33,22,33,29],[28,0,28,8],[29,0,29,1],[30,0,30,1],[31,0,31,1],[32,0,32,1],[33,0,33,1],[29,22,29,29],[3,0,3,8],[4,0,4,8],[11,0,11,8],[17,0,17,8],[21,0,21,8],[2,38,2,45],[1,0,1,8],[2,0,2,8],[2,14,2,21],[2,22,2,29],[2,30,2,37]]}
["FILTROS:","Anx:","Requerido:","Puestos; Pacientes o Servicios:","Tipo:","Cumple:","No Cumple:","Calif:","Observaciones:"]
[{"$f":"Menu!$B$3","v":"CENTRO ESPECIALIZADO EN DIÁLISIS PERITONEAL"}]
["TALENTO HUMANO",null,null,null,null,null,null,null,null,null,null,null,null,null,"ADMINISTRATIVOS",null,null,null,null,null,null,null,"ASISTENCIALES",null,null,null,null,null,null,null,"TOTAL ADMINISTRATIVOS",null,null,null,null,null,null,null,"TOTAL ASISTENCIALES"]
["SERVICIO DE DIÁLISIS PERITONEAL",null,null,null,null,null,null,null,null,null,null,null,null,null,null,null,null,null,null,null,null,null,null,null,null,null,null,null,null,null,{"$f":"SUM(O5:O28)","v":60},0,0,0,0,0,10,0,60,0,0,0,0,0,0,0]
["CONSULTA EXTERNA Y ÁREA DE TRATAMIENTO DE DIÁLISIS  PERITONEAL",null,null,null,null,null,null,null,null,null,null,null,null,null,null,null,null,null,null,null,null,null,null,null,null,null,null,null,null,null,{"$f":"SUM(O6:O11)","v":0},0,0,0,0,0,0,0,50,0,0,0,0,0,0,0]
["DIÁLISIS PERITONEAL",{"$f":"B1","v":"Anx:"},{"$f":"C$1","v":"Requerido:"},"Puestos; Pacientes o Servicios:","Tipo:","Cumple:","No Cumple:","Calif:","Observaciones:",null,null,null,null,null,null,null,null,null,null,null,null,null,null,null,null,null,null,null,null,null,{"$f":"SUM(O7:O11)","v":0},0,0,0,0,0,0,0,50,0,0,0,0,0,0,0]
["Médico Tratante especialista en Nefrología o Medicina Interna o Terapia Intensiva con experiencia en formación y manejo a los pacientes en Hemodiálisis(  cursos y certificados  con el aval de la Sociedad de Nefrología, Diálisis Y Trasplantes y/o Universidades acreditadas, notarizados)(1/50 Pacientes)",null,{"$f":"ROUNDUP(D7/12,0)","v":0},0,"Requerido",0," ",{"$f":"IF(AND(F7>=C7,C7>0,F7>=1),10,0)","v":0},null,null,"ASISTENCIAL",null,null,null,null,null,null,null,null,null,null,null,{"$f":"IF(UPPER(E7)=\"REQUERIDO\", 10, \"\")","v":10},{"$f":"IF(UPPER(E7)=\"REQUERIDO\", H7, \"\")","v":0}]
["Enfermera 1/30 Pacientes",null,{"$f":"ROUNDUP(D8/6,0)","v":0},0,"Requerido",0,0,{"$f":"IF(AND(F8>=C8,C8>0,F8>=1),10,0)","v":0},null,null,"ASISTENCIAL",null,null,null,null,null,null,null,null,null,null,null,10,0]
["Psicólogo Clínico",null,1,null,"Requerido",0,0,{"$f":"IF(AND(F9>=C9,C9>0,F9>=1),10,0)","v":0},null,null,"ASISTENCIAL",null,null,null,null,null,null,null,null,null,null,null,10,0]
["Nutricionista",null,1,null,"Requerido",0,0,0,null,null,"ASISTENCIAL",null,null,null,null,null,null,null,null,null,null,null,10,0]
["Trabajador Social",null,1,null,"Requerido",0,0,0,null,null,"ASISTENCIAL",null,null,null,null,null,null,null,null,null,null,null,10,0]
["SERVICIOS DE APOYO",null,null,null,null,null,null,null,null,null,null,null,null,null,null,null,null,null,null,null,null,null,null,null,null,null,null,null,null,null,{"$f":"SUM(O13:O17)","v":20},0,0,0,0,0,0,0,10,0,0,0,0,0,0,0]
["ADMISIÓN Y ESTADISTICA",{"$f":"B1","v":"Anx:"},{"$f":"C$1","v":"Requerido:"},"Puestos; Pacientes o Servicios:","Tipo:","Cumple:","No Cumple:","Calif:","Observaciones:",null,null,null,null,null,null,null,null,null,null,null,null,null,null,null,null,null,null,null,null,null,{"$f":"SUM(O14:O14)","v":10},0,0,0,0,0,0,0,0,0,0,0,0,0,0,0]
["Asistente administrativo",null,1,null,"Requerido",0,0,{"$f":"IF(AND(F14>=C14,C14>0,F14>=1),10,0)","v":0},null,null,"ADMINISTRATIVO",null,null,null,{"$f":"IF(UPPER(E14)=\"REQUERIDO\", 10, \"\")","v":10},{"$f":"IF(UPPER(E14)=\"REQUERIDO\", H14, \"\")","v":0}]
["FARMACIA",{"$f":"B1","v":"Anx:"},{"$f":"C$1","v":"Requerido:"},"Puestos; Pacientes o Servicios:","Tipo:","Cumple:","No Cumple:","Calif:","Observaciones:",null,null,null,null,null,null,null,null,null,null,null,null,null,null,null,null,null,null,null,null,null,{"$f":"SUM(O16:O17)","v":10},0,0,0,0,0,0,0,10,0,0,0,0,0,0,0]
["Responsable Técnico Químico Farmacéutico o Bioquímico Farmacéutico",null,1,null,"Requerido",0,0,{"$f":"IF(AND(F16>=C16,C16>0,F16>=1),10,0)","v":0},null,null,"ADMINISTRATIVO",null,null,null,{"$f":"IF(UPPER(E16)=\"REQUERIDO\", 10, \"\")","v":10},{"$f":"IF(UPPER(E16)=\"REQUERIDO\", H16, \"\")","v":0}]
["Asistente de Farmacia",null,1,null,"Requerido",0,0,{"$f":"IF(AND(F17>=C17,C17>0,F17>=1),10,0)","v":0},null,null,"ASISTENCIAL",null,null,null,null,null,null,null,null,null,null,null,{"$f":"IF(UPPER(E17)=\"REQUERIDO\", 10, \"\")","v":10},{"$f":"IF(UPPER(E17)=\"REQUERIDO\", H17, \"\")","v":0}]
["ADMINISTRACIÓN",null,null,null,null,null,null,null,null,null,null,null,null,null,null,null,null,null,null,null,null,null,null,null,null,null,null,null,null,null,{"$f":"SUM(O19:O21)","v":20},0,0,0,0,0,0,0,0,0,0,0,0,0,0,0]
["DIRECCIÓN Y GESTIÓN ADMINISTRATIVA",{"$f":"B1","v":"Anx:"},{"$f":"C$1","v":"Requerido:"},"Puestos; Pacientes o Servicios:","Tipo:","Cumple:","No Cumple:","Calif:","Observaciones:",null,null,null,null,null,null,null,null,null,null,null,null,null,null,null,null,null,null,null,null,null,{"$f":"SUM(O20:O21)","v":20},0,0,0,0,0,0,0,0,0,0,0,0,0,0,0]
["Director Médico Nefrólogo  (Será responsable de área Técnica y Tratamiento de los Pacientes)",null,1,null,"Requerido",0,0,{"$f":"IF(AND(F20>=C20,C20>0,F20>=1),10,0)","v":0},null,null,"ADMINISTRATIVO",null,null,null,{"$f":"IF(UPPER(E20)=\"REQUERIDO\", 10, \"\")","v":10},{"$f":"IF(UPPER(E20)=\"REQUERIDO\", H20, \"\")","v":0}]
["Jefa de Enfermeras ( Licenciada en enfermería)",null,1,null,"Requerido",0,0,{"$f":"IF(AND(F21>=C21,C21>0,F21>=1),10,0)","v":0},null,null,"ADMINISTRATIVO"," ",null,null,{"$f":"IF(UPPER(E21)=\"REQUERIDO\", 10, \"\")","v":10},{"$f":"IF(UPPER(E21)=\"REQUERIDO\", H21, \"\")","v":0}]
["SERVICIOS GENERALES",null,null,null,null,null,null,null,null,null,null,null,null,null,null,null,null,null,null,null,null,null,null,null,null,null,null,null,null,null,{"$f":"SUM(O23:O28)","v":20},{"$f":"SUM(P23:P28)","v":0},0,0,{"$f":"SUM(S23:S28)","v":0},{"$f":"SUM(T23:T28)","v":0},10,{"$f":"SUM(V23:V28)","v":0},{"$f":"SUM(W23:W28)","v":0},0,{"$f":"SUM(Y23:Y28)","v":0},{"$f":"SUM(Z23:Z28)","v":0},0,{"$f":"SUM(AB23:AB28)","v":0},{"$f":"SUM(AC23:AC28)","v":0},0]
["LIMPIEZA",{"$f":"B1","v":"Anx:"},{"$f":"C$1","v":"Requerido:"},"Puestos; Pacientes o Servicios:","Tipo:","Cumple:","No Cumple:","Calif:","Observaciones:",null,null,null,null,null,null,null,null,null,null,null,null,null,null,null,null,null,null,null,null,null,{"$f":"SUM(O24:O24)","v":10},0,0,0,0,0,0,0,0,0,0,0,0,0,0,0]
["Auxiliar de Servicios (Limpieza)",null,1,null,"Requerido",0,0,{"$f":"IF(AND(F24>=C24,C24>0,F24>=1),10,0)","v":0},null,null,"ADMINISTRATIVO",null,null,null,{"$f":"IF(UPPER(E24)=\"REQUERIDO\", 10, \"\")","v":10},{"$f":"IF(UPPER(E24)=\"REQUERIDO\", H24, \"\")","v":0}]
["MANTENIMIENTO",{"$f":"B1","v":"Anx:"},{"$f":"C$1","v":"Requerido:"},"Puestos; Pacientes o Servicios:","Tipo:","Cumple:","No Cumple:","Calif:","Observaciones:",null,null,null,null,null,null,null,null,null,null,null,null,null,null,null,null,null,null,null,null,null,{"$f":"SUM(O26)","v":0},{"$f":"SUM(P26)","v":0},{"$f":"SUM(Q26)","v":0},{"$f":"SUM(R26)","v":0},0,0,10,0,0,0,0,0,0,0,0,0]
["Técnico de Mantenimiento",null,1,null,"Condición",0,0,{"$f":"IF(AND(F26>=C26,C26>0,F26>=1),10,0)","v":0},null,null,"ADMINISTRATIVO",null,null,null,null,null,null,null,null,null,{"$f":"IF(UPPER(E26)=\"CONDICIÓN\", 10, \"\")","v":10},{"$f":"IF(UPPER(E26)=\"CONDICIÓN\", H26, \"\")","v":0}]
["BODEGA",{"$f":"B1","v":"Anx:"},{"$f":"C$1","v":"Requerido:"},"Puestos; Pacientes o Servicios:","Tipo:","Cumple:","No Cumple:","Calif:","Observaciones:",null,null,null,null,null,null,null,null,null,null,null,null,null,null,null,null,null,null,null,null,null,{"$f":"SUM(O28:O28)","v":10},0,0,0,0,0,0,0,0,0,0,0,0,0,0,0]
["Auxiliar de Servicios (Guardalmacén)",null,1,null,"Requerido",0,0,{"$f":"IF(AND(F28>=C28,C28>0,F28>=1),10,0)","v":0},null,null,"ADMINISTRATIVO",null,null,null,{"$f":"IF(UPPER(E28)=\"REQUERIDO\", 10, \"\")","v":10},{"$f":"IF(UPPER(E28)=\"REQUERIDO\", H28, \"\")","v":0}]
["TOTALES PARCIALES:",null,null,null,null,null,null,null,null,null,null,null,null,null,null,null,null,null,null,null,null,null,"TOTAL GENERAL:",null,null,null,null,null,null,null,{"$f":"(+TalentoHumano!$AE$4)","v":60},{"$f":"(+TalentoHumano!$AF$4)","v":0},{"$f":"(+TalentoHumano!$AG$4)","v":0},{"$f":"(+TalentoHumano!$AH$4)","v":0},{"$f":"(+TalentoHumano!$AI$4)","v":0},{"$f":"(+TalentoHumano!$AJ$4)","v":0},{"$f":"(+TalentoHumano!$AK$4)","v":10},{"$f":"(+TalentoHumano!$AL$4)","v":0},{"$f":"(+TalentoHumano!$AM$4)","v":60},{"$f":"(+TalentoHumano!$AN$4)","v":0},{"$f":"(+TalentoHumano!$AO$4)","v":0},{"$f":"(+TalentoHumano!$AP$4)","v":0},{"$f":"(+TalentoHumano!$AQ$4)","v":0},{"$f":"(+TalentoHumano!$AR$4)","v":0},{"$f":"(+TalentoHumano!$AS$4)","v":0},{"$f":"(+TalentoHumano!$AT$4)","v":0}]
["ADMINISTRATIVOS:",null,"% Obtenido:","% Obtenido:","% Obtenido:","% A Cumplir:","% Final:",null,null,null,null,null,null,null,null,null,null,null,null,null,null,null,"SERVICIO DE DIÁLISIS PERITONEAL",null,null,null,null,null,null,null,{"$f":"AE4*100/AE29","v":100},{"$f":"AF4*100/AE29","v":0},{"$f":"AG4*100/AG29","v":{"$error":"#DIV/0!"}},{"$f":"AH4*100/AG29","v":{"$error":"#DIV/0!"}},{"$f":"AI4*100/AI29","v":{"$error":"#DIV/0!"}},{"$f":"AJ4*100/AI29","v":{"$error":"#DIV/0!"}},{"$f":"AK4*100/AK29","v":100},{"$f":"AL4*100/AK29","v":0},{"$f":"AM4*100/AM29","v":100},{"$f":"AN4*100/AM29","v":0},{"$f":"AO4*100/AO29","v":{"$error":"#DIV/0!"}},{"$f":"AP4*100/AO29","v":{"$error":"#DIV/0!"}},{"$f":"AQ4*100/AQ29","v":{"$error":"#DIV/0!"}},{"$f":"AR4*100/AQ29","v":{"$error":"#DIV/0!"}},{"$f":"AS4*100/AS29","v":{"$error":"#DIV/0!"}},{"$f":"AT4*100/AS29","v":{"$error":"#DIV/0!"}}]
[{"$f":"TalentoHumano!$W$30","v":"SERVICIO DE DIÁLISIS PERITONEAL"},null,{"$f":"TalentoHumano!$AF$30*30/100/100","v":0},null,null,{"$f":"TalentoHumano!$AE$30*30/100/100","v":0.3},{"$f":"IF(TalentoHumano!$C$31=TalentoHumano!$F$31, \"CUMPLE\", \"NO CUMPLE\")","v":"NO CUMPLE"},null,null,null,null,null,null,null,null,null,null,null,null,null,null,null,"CONSULTA EXTERNA Y ÁREA DE TRATAMIENTO DE DIÁLISIS  PERITONEAL",null,null,null,null,null,null,null,{"$f":"AE5*100/AE29","v":0},{"$f":"AF5*100/AE29","v":0},{"$f":"AG5*100/AG29","v":{"$error":"#DIV/0!"}},{"$f":"AH5*100/AG29","v":{"$error":"#DIV/0!"}},{"$f":"AI5*100/AI29","v":{"$error":"#DIV/0!"}},{"$f":"AJ5*100/AI29","v":{"$error":"#DIV/0!"}},{"$f":"AK5*100/AK29","v":0},{"$f":"AL5*100/AK29","v":0},{"$f":"AM5*100/AM29","v":83.333333333333329},{"$f":"AN5*100/AM29","v":0},{"$f":"AO5*100/AO29","v":{"$error":"#DIV/0!"}},{"$f":"AP5*100/AO29","v":{"$error":"#DIV/0!"}},{"$f":"AQ5*100/AQ29","v":{"$error":"#DIV/0!"}},{"$f":"AR5*100/AQ29","v":{"$error":"#DIV/0!"}},{"$f":"AS5*100/AS29","v":{"$error":"#DIV/0!"}},{"$f":"AT5*100/AS29","v":{"$error":"#DIV/0!"}}]
[{"$f":"TalentoHumano!$W$32","v":"SERVICIOS DE APOYO"},null,null,{"$f":"TalentoHumano!$AF$32*30/100/100","v":0},null,{"$f":"TalentoHumano!$AE$32*30/100/100","v":0.10000000000000002},{"$f":"IF(TalentoHumano!$D$32=TalentoHumano!$F$32, \"CUMPLE\", \"NO CUMPLE\")","v":"NO CUMPLE"},null,null,null,null,null,null,null,null,null,null,null,null,null,null,null,"SERVICIOS DE APOYO",null,null,null,null,null,null,null,{"$f":"AE12*100/AE29","v":33.333333333333336},{"$f":"AF12*100/AE29","v":0},{"$f":"AG12*100/AG29","v":{"$error":"#DIV/0!"}},{"$f":"AH12*100/AG29","v":{"$error":"#DIV/0!"}},{"$f":"AI12*100/AI29","v":{"$error":"#DIV/0!"}},{"$f":"AJ12*100/AI29","v":{"$error":"#DIV/0!"}},{"$f":"AK12*100/AK29","v":0},{"$f":"AL12*100/AK29","v":0},{"$f":"AM12*100/AM29","v":16.666666666666668},{"$f":"AN12*100/AM29","v":0},{"$f":"AO12*100/AO29","v":{"$error":"#DIV/0!"}},{"$f":"AP12*100/AO29","v":{"$error":"#DIV/0!"}},{"$f":"AQ12*100/AQ29","v":{"$error":"#DIV/0!"}},{"$f":"AR12*100/AQ29","v":{"$error":"#DIV/0!"}},{"$f":"AS12*100/AS29","v":{"$error":"#DIV/0!"}},{"$f":"AT12*100/AS29","v":{"$error":"#DIV/0!"}}]
[{"$f":"TalentoHumano!$W$33","v":"ADMINISTRACIÓN"},null,null,{"$f":"TalentoHumano!$AF$33*30/100/100","v":0},null,{"$f":"TalentoHumano!$AE$33*30/100/100","v":0.10000000000000002},{"$f":"IF(TalentoHumano!$D$33=TalentoHumano!$F$33, \"CUMPLE\", \"NO CUMPLE\")","v":"NO CUMPLE"},null,null,null,null,null,null,null,null,null,null,null,null,null,null,null,"ADMINISTRACIÓN",null,null,null,null,null,null,null,{"$f":"AE18*100/AE29","v":33.333333333333336},{"$f":"AF18*100/AE29","v":0},{"$f":"AG18*100/AG29","v":{"$error":"#DIV/0!"}},{"$f":"AH18*100/AG29","v":{"$error":"#DIV/0!"}},{"$f":"AI18*100/AI29","v":{"$error":"#DIV/0!"}},{"$f":"AJ18*100/AI29","v":{"$error":"#DIV/0!"}},{"$f":"AK18*100/AK29","v":0},{"$f":"AL18*100/AK29","v":0},{"$f":"AM18*100/AM29","v":0},{"$f":"AN18*100/AM29","v":0},{"$f":"AO18*100/AO29","v":{"$error":"#DIV/0!"}},{"$f":"AP18*100/AO29","v":{"$error":"#DIV/0!"}},{"$f":"AQ18*100/AQ29","v":{"$error":"#DIV/0!"}},{"$f":"AR18*100/AQ29","v":{"$error":"#DIV/0!"}},{"$f":"AS18*100/AS29","v":{"$error":"#DIV/0!"}},{"$f":"AT18*100/AS29","v":{"$error":"#DIV/0!"}}]
[{"$f":"TalentoHumano!$W$34","v":"SERVICIOS GENERALES"},null,null,{"$f":"TalentoHumano!$AF$34*30/100/100","v":0},null,{"$f":"TalentoHumano!$AE$34*30/100/100","v":0.10000000000000002},{"$f":"IF(TalentoHumano!$D$34=TalentoHumano!$F$34, \"CUMPLE\", \"NO CUMPLE\")","v":"NO CUMPLE"},null,null,null,null,null,null,null,null,null,null,null,null,null,null,null,"SERVICIOS GENERALES",null,null,null,null,null,null,null,{"$f":"AE22*100/AE29","v":33.333333333333336},{"$f":"AF22*100/AE29","v":0},{"$f":"AG22*100/AG29","v":{"$error":"#DIV/0!"}},{"$f":"AH22*100/AG29","v":{"$error":"#DIV/0!"}},{"$f":"AI22*100/AI29","v":{"$error":"#DIV/0!"}},{"$f":"AJ22*100/AI29","v":{"$error":"#DIV/0!"}},{"$f":"AK22*100/AK29","v":100},{"$f":"AL22*100/AK29","v":0},{"$f":"AM22*100/AM29","v":0},{"$f":"AN22*100/AM29","v":0},{"$f":"AO22*100/AO29","v":{"$error":"#DIV/0!"}},{"$f":"AP22*100/AO29","v":{"$error":"#DIV/0!"}},{"$f":"AQ22*100/AQ29","v":{"$error":"#DIV/0!"}},{"$f":"AR22*100/AQ29","v":{"$error":"#DIV/0!"}},{"$f":"AS22*100/AS29","v":{"$error":"#DIV/0!"}},{"$f":"AT22*100/AS29","v":{"$error":"#DIV/0!"}}]
["TOTAL REQUERIDO:",null,null,null,null,0.30000001192092801,{"$f":"SUM(TalentoHumano!$C$31                                                        : TalentoHumano!$C$34)","v":0}]
["TOTAL OPCIONAL:",null,null,null,null,0.30000001192092801,{"$f":"30/100","v":0.3}]
["TOTAL DESEABLE:",null,null,null,null,0.30000001192092801,{"$f":"30/100","v":0.3}]
["TOTAL CONDICIÓN:",null,null,null,null,0.30000001192092801,{"$f":"TalentoHumano!$AL$29*30/TalentoHumano!$AK$29/100","v":0}]
["ASISTENCIALES:",null,"% Obtenido:","% Obtenido:","% Obtenido:","% A Cumplir:","% Final:"]
[{"$f":"TalentoHumano!$W$30","v":"SERVICIO DE DIÁLISIS PERITONEAL"},null,{"$f":"TalentoHumano!$AN$30*70/100/100","v":0},null,null,{"$f":"TalentoHumano!$AM$30*70/100/100","v":0.7},{"$f":"IF(TalentoHumano!$C$40=TalentoHumano!$F$40, \"CUMPLE\", \"NO CUMPLE\")","v":"NO CUMPLE"}]
[{"$f":"TalentoHumano!$W$31","v":"CONSULTA EXTERNA Y ÁREA DE TRATAMIENTO DE DIÁLISIS  PERITONEAL"},null,null,{"$f":"TalentoHumano!$AN$31*70/100/100","v":0},null,{"$f":"TalentoHumano!$AM$31*70/100/100","v":0.58333333333333326},{"$f":"IF(TalentoHumano!$D$41=TalentoHumano!$F$41, \"CUMPLE\", \"NO CUMPLE\")","v":"NO CUMPLE"}]
[{"$f":"TalentoHumano!$W$32","v":"SERVICIOS DE APOYO"},null,null,{"$f":"TalentoHumano!$AN$32*70/100/100","v":0},null,{"$f":"TalentoHumano!$AM$32*70/100/100","v":0.11666666666666668},{"$f":"IF(TalentoHumano!$D$42=TalentoHumano!$F$42, \"CUMPLE\", \"NO CUMPLE\")","v":"NO CUMPLE"}]
["TOTAL REQUERIDO:",null,null,null,null,0.69999998807907104,{"$f":"SUM(TalentoHumano!$C$40                                                      : TalentoHumano!$C$42)","v":0}]
["TOTAL OPCIONAL:",null,null,null,null,0.69999998807907104,{"$f":"70/100","v":0.7}]
["TOTAL DESEABLE:",null,null,null,null,0.69999998807907104,{"$f":"70/100","v":0.7}]
["TOTAL CONDICIÓN:",null,null,null,null,0.69999998807907104,{"$f":"70/100","v":0.7}]
["TOTALES COMPONENTE:"]
["TOTAL % REQUERIDO:",null,null,null,null,0.34999999403953552,{"$f":"(+TalentoHumano!$G$35+TalentoHumano!$G$43)*35/100","v":0}]
["TOTAL % OPCIONAL:",null,null,null,null,0.34999999403953552,{"$f":"(+TalentoHumano!$G$36+TalentoHumano!$G$44)*35/100","v":0.35}]
["TOTAL % DESEABLE:",null,null,null,null,0.34999999403953552,{"$f":"(+TalentoHumano!$G$37+TalentoHumano!$G$45)*35/100","v":0.35}]
["TOTAL % CONDICIÓN:",null,null,null,null,0.34999999403953552,{"$f":"(+TalentoHumano!$G$38+TalentoHumano!$G$46)*35/100","v":0.245}]

{"sheet":"Reportes","index":8,"n_rows":24,"n_cols":8,"rows_kept":24,"cut":false,"hidden":false,"merged":[[14,0,14,2],[15,0,15,2],[17,0,17,8],[20,0,20,1],[20,7,23,8],[21,0,21,1],[22,0,22,1],[23,0,23,1],[8,0,8,2],[9,0,9,2],[18,0,18,1],[8,3,8,7],[9,3,9,7],[10,3,10,7],[11,3,11,7],[12,3,12,7],[13,3,13,7],[14,3,14,7],[15,3,15,7],[18,7,19,8],[19,0,19,1],[10,0,10,2],[12,0,12,2],[13,0,13,2],[5,0,5,2],[6,0,6,2],[7,0,7,2],[5,3,5,7],[6,3,6,7],[7,3,7,7],[0,0,0,7],[1,0,1,7],[2,0,2,2],[3,0,3,2],[4,0,4,2],[2,3,2,7],[3,3,3,7],[4,3,4,7]]}
["MATRIZ DE LICENCIAMIENTO:"]
[{"$f":"Menu!B3","v":"CENTRO ESPECIALIZADO EN DIÁLISIS PERITONEAL"}]
["ENTIDAD DEL SISTEMA:",null,null,""]
["NOMBRE UNIDAD OPERATIVA:"]
["CÓDIGO:"]
["REGION:",null,null,"COSTA"]
["PROVINCIA:",null,null,"GUAYAS"]
["CANTON:",null,null,"GUAYAQUIL"]
["PARROQUIA:"]
["ZONA:"]
["DIRECCIÓN:"]
[null,null,"TELÉFONO:"]
["AREA/DISTRITO:"]
["RESPONSABLE:",null,null," "]
["CORREO ELECTRÓNICO:"]
["FECHA:"]
[]
["RESULTADOS TOTALES"]
["COMPONENTE:",null,"% A Cumplir","% Requerido","% Opcional","% Deseable","% Condición","RESULTADOS"]
["INFRAESTRUCTURA",null,{"$f":"30/100","v":0.3},{"$f":"Infraestructura!$G$286","v":0},{"$f":"Infraestructura!$G$287","v":0.15},{"$f":"Infraestructura!$G$288","v":0.15},{"$f":"Infraestructura!$G$289","v":0}]
["EQUIPAMIENTO",null,{"$f":"30/100","v":0.3},{"$f":"Equipamiento!$G$589","v":0},{"$f":"Equipamiento!$G$590","v":7.4999999999999997E-2},{"$f":"Equipamiento!$G$591","v":0.22500000000000001},{"$f":"Equipamiento!$G$592","v":0.22500000000000001},{"$f":"IF(D24<0.7, \"NO LICENCIA\", IF(D24<0.85,\"LICENCIA CONDICIONADA\", IF(D24<=1, \"SI LICENCIA\", \"\")))","v":"NO LICENCIA"}]
["TALENTO HUMANO",null,{"$f":"35/100","v":0.35},{"$f":"TalentoHumano!$G$48","v":0},{"$f":"TalentoHumano!$G$49","v":0.35},{"$f":"TalentoHumano!$G$50","v":0.35},{"$f":"TalentoHumano!$G$51","v":0.245}]
["NORMA TECNICA",null,{"$f":"5/100","v":0.05},{"$f":"Norma!$G$106","v":0},{"$f":"Norma!$G$107","v":0.05},{"$f":"Norma!$G$108","v":0.05},{"$f":"Norma!$G$109","v":0}]
["Total:",null,{"$f":"SUM(C20:C23)","v":1},{"$f":"SUM(D20:D23)","v":0},{"$f":"SUM(E20:E23)","v":0.625},{"$f":"SUM(F20:F23)","v":0.77500000000000002},{"$f":"SUM(G20:G23)","v":0.47}]